{"text_format":"1","workbook":"xlsx","n_sheets":36,"sheets":["Menu","Proj Info","Mix Info","E820150","Batch Wts.","E820150A","Grad 1","Grad 2","Grad 3","Combined","Gradation","CW","Maturity","Report ","Summary","FM Report","FM Summary","Diary","Paving History","CA","FA","CEMENT","FLYASH","SLAG","ADMIX-AIR","ADMIX-WR","ADMIX-MR","ADMIX-HR","ADMIX-RETARDER","ADMIX-SP","FIBERS","ADMIX-FF","COUNTIES","ADMIX-CO2","ALL ELSE","MASTER"],"not_rendered":{"charts":2,"images":0,"macros":1,"external_links":0,"defined_names":13,"comments":0,"pivot_tables":0},"unopened":[{"sheet":"CW","index":11,"reason":"not_a_worksheet"}],"bounds":{"document_bytes":16777216,"sheet_cells":100000,"rows_first":2000,"rows_last":500,"rows_between":2000,"halvings":0,"cell_chars":16384,"cell_head_chars":4096},"cells_cut":0,"cells_raw":0,"read":"whole","date_system":"1900"}

{"sheet":"Menu","index":0,"n_rows":15,"n_cols":5,"rows_kept":15,"cut":false,"hidden":false,"merged":[]}
["PC Plant Program","C. Barko","2025-01-01","v12.0","C. Barko"]
[" Project & Plant Information","Proj Info","Use for English or Metric Projects"]
[" Mix Information Screen","Mix Info"]
["Batch Weight Form E820150","E820150"]
[" Wet Batch Weight Information Screen","Batch Wts."]
[" Sieve Analysis Screen No. 1","Grad 1"]
[" Sieve Analysis Screen No. 2","Grad 2"]
[" Sieve Analysis Screen No. 3","Grad 3"]
["Coarseness & Workability","CW"]
["Flexural Maturity Summary","Maturity"]
[" PCC Plant Report  800240E","Report"]
[" Material Production Summary","Summary"]
["Flowable Mortar Plant Report","FM Report"]
["Flowable Mortar Summary","FM Summary"]
[" Daily  Diary","Diary"]

{"sheet":"Proj Info","index":1,"n_rows":1003,"n_cols":22,"rows_kept":1003,"cut":false,"hidden":false,"merged":[[16,2,22,2],[30,2,31,2]]}
["English or Metric (E or M): ","E",null,"E"]
["Report No.:  ",null,null,"M","<== Add a suffix to the plant report number here.",null,null,null,null,null,null,null,null,null,null,null,null,null,"001"]
["Date This Report:  ",null,null,null,null,null,null,null,null,null,null,null,null,null,null,null,null,null,"002"]
["Date Last Report:  ",null,null,null,null,null,null,null,null,null,null,null,null,null,null,null,null,null,"003"]
["Paving Plant Weather:  ",null,null,null,null,null,null,null,null,null,null,null,null,null,null,null,null,null,"004"]
["Paving Plant Minimum Temperature:  ",null,{"$f":"IF(B1=\"E\",\"F\", \"C\")","v":"F"},null,null,null,null,null,null,null,null,null,null,null,null,null,null,null,"005"]
["Paving Plant Maximum Temperature:  ",null,{"$f":"IF(B1=\"E\",\"F\", \"C\")","v":"F"},null,null,null,null,null,null,null,null,null,null,null,null,null,null,null,"006"]
["Project No.:  ",null,null,null,null,null,null,null,null,null,null,null,null,null,null,null,null,null,"007"]
["Mix ID:  ",null,null,null,null,null,null,null,null,null,null,null,null,null,null,null,null,null,"008"]
["Plant Name and Location:  ",null,null,null,null,null,null,null,null,null,null,null,null,null,null,null,null,null,"009"]
["Contractor:  ",null,null,null,null,null,null,null,null,null,null,null,null,null,null,null,null,null,"010"]
["Sub Contractor:  ",null,null,null,null,null,null,null,null,null,null,null,null,null,null,null,null,null,"011"]
["Contract ID:  ",null,null,null,null,null,null,null,null,null,null,null,null,null,null,null,null,null,"012"]
["County:  ",null,null,null,null,null,null,null,null,null,null,null,null,null,null,null,null,null,"013",null,null,"Yes "]
["Structures Design Number :  ",null,null,null,null,null,null,null,null,null,null,null,null,null,null,null,null,null,"014"]
["Was Maturity Used?:  ",null,null,null,null,null,null,null,null,null,null,null,null,null,null,null,null,null,"015"]
["Maturity Mix ID:  ",null,"Must fill in this section after the Mix Info tab",null,null,null,null,null,null,null,null,null,null,null,null,null,null,null,"016"]
["Curve Type:  ",null,null,null,null,null,null,null,null,null,null,null,null,null,null,null,null,null,"017"]
["Curve Strength:  ",null,null,null,null,null,null,null,null,null,null,null,null,null,null,null,null,null,"018"]
["Curve # Assigned By District Materials:  ",null,null,null,null,null,null,null,null,null,null,null,null,null,null,null,null,null,"019"]
["Current Curve / Validation Date:  ",null,null,null,null,null,null,null,null,null,null,null,null,null,null,null,null,null,"020"]
["Curve Expiration Date:  ",{"$f":"IF(B21=\"\",\"\", (B21+90))","v":""},null,null,null,null,null,null,null,null,null,null,null,null,null,null,null,null,"021"]
["TTF:  ",null,null,null,null,null,null,null,null,null,null,null,null,null,null,null,null,null,"022"]
["Max On Grade W/C Ratio (From Maturity Form):  ",null,null,null,null,null,null,null,null,null,null,null,null,null,null,null,null,null,"023"]
["Central Plant (X):  ",null,{"$f":"IF(AND(B25=\"\",B26=\"\"), \"<== Make Selections\", \"\")","v":"<== Make Selections"},null,null,null,null,null,null,null,null,null,null,null,null,null,null,null,"024"]
["Ready Mix (X):  ",null,{"$f":"IF(AND(B25=\"\",B26=\"\"), \"<== Make Selections\", \"\")","v":"<== Make Selections"},null,null,null,null,null,null,null,null,null,null,null,null,null,null,null,"025"]
["Paving (X):  ",null,{"$f":"IF(AND(B25=\"\",B26=\"\"), \"<==Select Placement Type\", IF(AND(OR(B25<>\"\",B26<>\"\"),OR(B27<>\"\", B29<>\"\",B31<>\"\",B32<>\"\")), \"\", \"<==Select Placement Type\" ))","v":"<==Select Placement Type"},null,null,null,null,null,null,null,null,null,null,null,null,null,null,null,"026"]
["Production (X):  ",null,null,null,null,null,null,null,null,null,null,null,null,null,null,null,null,null,"027"]
["Structural (X):  ",null,{"$f":"IF(AND(B25=\"\",B26=\"\"), \"<==Select Placement Type\", IF(AND(OR(B25<>\"\",B26<>\"\"),OR(B27<>\"\",B29<>\"\",B31<>\"\",B32<>\"\")), \"\", \"<==Select Placement Type\" ))","v":"<==Select Placement Type"},null,null,null,null,null,null,null,null,null,null,null,null,null,null,null,"028"]
["Placement (X):  ",null,null,null,null,null,null,null,null,null,null,null,null,null,null,null,null,null,"029"]
["Non-structural (X):  ",null,"Enter Alternate Source Not Listed In This Column",null,null,null,null,null,null,null,null,null,null,null,null,null,null,null,"030"]
["Miscellaneous (X):  ",null,null,null,null,null,null,null,null,null,null,null,null,null,null,null,null,null,"031"]
["Cement Source:  ",null,null,null,null,null,null,null,null,null,null,null,null,null,null,null,null,null,"032"]
["Cement Type:  ",{"$f":"IF(B33=\"\",\"\",VLOOKUP(B33,CEMENT!A4:E70,4,FALSE))","v":""},null,null,null,null,null,null,null,null,null,null,null,null,null,null,null,null,"033"]
["Cement Specific Gravity:  ",{"$f":"IF(B33=\"\",\"\",VLOOKUP(B33,CEMENT!A4:E70,5,FALSE))","v":""},null,null,null,null,null,null,null,null,null,null,null,null,null,null,null,null,"034"]
["Fly Ash Source:  ",null,null,null,null,null,null,null,null,null,null,null,null,null,null,null,null,null,"035"]
["Fly Ash Type:  ",{"$f":"IF(B36=\"\",\"\",VLOOKUP(B36,FLYASH!A4:E70,4,FALSE))","v":""},null,null,null,null,null,null,null,null,null,null,null,null,null,null,null,null,"036"]
["Fly Ash Specific Gravity:  ",{"$f":"IF(B36=\"\",\"\",VLOOKUP(B36,FLYASH!A4:E70,5,FALSE))","v":""},null,null,null,null,null,null,null,null,null,null,null,null,null,null,null,null,"037"]
["GGBFS Source:  ",null,null,null,null,null,null,null,null,null,null,null,null,null,null,null,null,null,"038"]
["GGBFS Grade:  ",{"$f":"IF(B39=\"\",\"\",VLOOKUP(B39,SLAG!A4:E15,5,FALSE))","v":""},null,null,null,null,null,null,null,null,null,null,null,null,null,null,null,null,"039"]
["GGBFS Specific Gravity:  ",{"$f":"IF(B39=\"\",\"\",VLOOKUP(B39,SLAG!A4:E15,4,FALSE))","v":""},null,null,null,null,null,null,null,null,null,null,null,null,null,null,null,null,"040"]
["Coarse Aggregate T-203 A # & Source:  ",null,null,null,"1.5 or 2.5",null,null,null,null,null,null,null,null,null,null,null,null,null,"041"]
["Coarse Aggregate Gradation No. :",null,"2, 3, 4, 5, 6, or Blank","0-2.5",2.5,"<== Enter Max. %passing No. 200 ",null,null,null,null,null,null,null,null,null,null,null,null,"042"]
["Intermediate Aggregate T-203 A # & Source:  ",null,null,"0-1.5","No","<== Is the coarse aggregate Gravel or Quartzite?",null,null,null,null,null,null,null,null,null,null,null,null,"043"]
["Intermediate Aggregate Gradation No. :",null,"2, 6 or Blank",null,null,null,null,null,null,null,null,null,null,null,null,null,null,null,"044"]
["Fine Aggregate T-203 A # & Source:  ",null,null,null,null,null,null,null,null,null,null,null,null,null,null,null,null,null,"045"]
["Fine Aggregate Gradation No. :",null,"1, 7, or Blank",null,null,null,null,null,null,null,null,null,null,null,null,null,null,null,"046"]
["Air Entraining Brand / Source:  ",null,null,null,null,null,null,null,null,null,null,null,null,null,null,null,null,null,"047"]
["Air Entraining Rate:  ",null,null,null,null,null,null,null,null,null,null,null,null,null,null,null,null,null,"048"]
["Air Entraining Lot No.:  ",null,null,null,null,null,null,null,null,null,null,null,null,null,null,null,null,null,"049"]
["Normal Water Reducer Brand / Source:  ",null,null,"Normal",null,null,null,null,null,null,null,null,null,null,null,null,null,null,"050"]
["Normal Water Reducer Rate:  ",null,null,"MR",null,null,null,null,null,null,null,null,null,null,null,null,null,null,"051"]
["Normal Water Reducer Lot No.:  ",null,null,"HR",null,null,null,null,null,null,null,null,null,null,null,null,null,null,"052"]
["Mid-Range Water Reducer Brand / Source:  ",null,null,null,null,null,null,null,null,null,null,null,null,null,null,null,null,null,"053"]
["Mid-Range Water Reducer Rate:  ",null,null,null,null,null,null,null,null,null,null,null,null,null,null,null,null,null,"054"]
["Mid-Range Water Reducer Lot No.:  ",null,null,null,null,null,null,null,null,null,null,null,null,null,null,null,null,null,"055"]
["High-Range Water Reducer Brand / Source:  ",null,null,null,null,null,null,null,null,null,null,null,null,null,null,null,null,null,"056"]
["High-Range Water Reducer Rate:  ",null,null,null,null,null,null,null,null,null,null,null,null,null,null,null,null,null,"057"]
["High-Range Water Reducer Lot No.:  ",null,null,null,null,null,null,null,null,null,null,null,null,null,null,null,null,null,"058"]
["Retarder Brand / Source:  ",null,null,null,null,null,null,null,null,null,null,null,null,null,null,null,null,null,"059"]
["Retarder Rate:  ",null,null,null,null,null,null,null,null,null,null,null,null,null,null,null,null,null,"060"]
["Retarder Lot No.:  ",null,null,null,null,null,null,null,null,null,null,null,null,null,null,null,null,null,"061"]
["Special Performance Admixture Brand / Source:  ",null,null,null,null,null,null,null,null,null,null,null,null,null,null,null,null,null,"062"]
["Special Performance Admixture Rate:  ",null,null,null,null,null,null,null,null,null,null,null,null,null,null,null,null,null,"063"]
["Special Performance Admixture Lot No.:  ",null,null,null,null,null,null,null,null,null,null,null,null,null,null,null,null,null,"064"]
["Flowable Fill Admixture Brand / Source:  "]
["Flowable Fill Admixture Rate:  "]
["Flowable Fill Admixture Lot No.:  "]
["Concrete Fibers Brand / Source:  ",null,null,null,null,null,null,null,null,null,null,null,null,null,null,null,null,null,"065"]
["Lbs Of Concrete Fibers Per Cubic Yard:  ",null,"Enter English Units",null,null,null,null,null,null,null,null,null,null,null,null,null,null,null,"066"]
["CO2 Admix Brand:  ",null,null,null,null,null,null,null,null,null,null,null,null,null,null,null,null,null,"067"]
["CO2Admix (oz/cy):  ",null,null,null,null,null,null,null,null,null,null,null,null,null,null,null,null,null,"068"]
["Concrete Treatment - Ice ( X ):  ",null,null,null,null,null,null,null,null,null,null,null,null,null,null,null,null,null,"069"]
["Lbs Of Ice Per Cubic Yard :  ",null,"Enter English Units",null,null,null,null,null,null,null,null,null,null,null,null,null,null,null,"070"]
["Heated Water ( X ):  ",null,null,null,null,null,null,null,null,null,null,null,null,null,null,null,null,null,"071"]
["Heated Materials ( X ):  ",null,null,null,null,null,null,null,null,null,null,null,null,null,null,null,null,null,"072"]
["Liquid Nitrogen ( X ):  ",null,null,null,null,null,null,null,null,null,null,null,null,null,null,null,null,null,"073"]
["Certified Plant Inspector #1 Name:  ",null,null,null,null,null,null,null,null,null,null,null,null,null,null,null,null,null,"074"]
["C.P.I. #1 Certification No.:  ",null,null,null,null,null,null,null,null,null,null,null,null,null,null,null,null,null,"075"]
["Ready Mix / CPI #1 Phone No.:  ",null,null,null,null,null,null,null,null,null,null,null,null,null,null,null,null,null,"076"]
["Certified Plant Inspector #2 Name:  ",null,null,null,null,null,null,null,null,null,null,null,null,null,null,null,null,null,"077"]
["C.P.I. #2 Certification No.:  ",null,null,null,null,null,null,null,null,null,null,null,null,null,null,null,null,null,"078"]
["Ready Mix / CPI #2 Phone No.:  ",null,null,null,null,null,null,null,null,null,null,null,null,null,null,null,null,null,"079"]
["Plant Monitor #1 Name:  ",null,null,null,null,null,null,null,null,null,null,null,null,null,null,null,null,null,"080"]
["Plant Monitor #1 Certification No.:  ",null,null,null,null,null,null,null,null,null,null,null,null,null,null,null,null,null,"081"]
["Plant Monitor #1 Phone No.:  ",null,null,null,null,null,null,null,null,null,null,null,null,null,null,null,null,null,"082"]
["Plant Monitor #2 Name:  ",null,null,null,null,null,null,null,null,null,null,null,null,null,null,null,null,null,"083"]
["Plant Monitor #2 Certification No.:  ",null,null,null,null,null,null,null,null,null,null,null,null,null,null,null,null,null,"084"]
["Plant Monitor #2 Phone No.:  ",null,null,null,null,null,null,null,null,null,null,null,null,null,null,null,null,null,"085"]
["C.A. Specification Limits 1 1/2\" Sieve:",{"$f":"IF($B$43=3,\"100\",IF($B$43=4,\"100\",\"\"))","v":""},null,null,null,null,null,null,null,null,null,null,null,null,null,null,null,null,"086"]
["C.A. Specification Limits 1\" Sieve:",{"$f":"IF($B$43=3,\"95-100\",IF($B$43=4,\"50-100\",IF($B$43=5,\"100\",\"\")))","v":""},null,null,null,null,null,null,null,null,null,null,null,null,null,null,null,null,"087"]
["C.A. Specification Limits 3/4\" Sieve:",{"$f":"IF($B$43=4,\"30-100\",IF($B$43=5,\"90-100\",IF($B$43=6,\"100\",\"\")))","v":""},null,null,null,null,null,null,null,null,null,null,null,null,null,null,null,null,"088"]
["C.A. Specification Limits 1/2\" Sieve:",{"$f":"IF($B$43=2,\"95-100\",IF($B$43=3,\"25-60\",IF($B$43=4,\"20-75\",IF($B$43=6,\"90-100\",\"\"))))","v":""},null,null,null,null,null,null,null,null,null,null,null,null,null,null,null,null,"089"]
["C.A. Specification Limits 3/8\"  Sieve:",{"$f":"IF($B$43=4,\"5-55\",IF($B$43=5,\"20-55\",IF($B$43=6,\"40-90\",\"\")))","v":""},null,null,null,null,null,null,null,null,null,null,null,null,null,null,null,null,"090"]
["C.A. Specification Limits #4 Sieve:",{"$f":"IF($B$43=3,\"0-10\",IF($B$43=4,\"0-10\",IF($B$43=5,\"0-10\",IF($B$43=6,\"0-30\",\"\"))))","v":""},null,null,null,null,null,null,null,null,null,null,null,null,null,null,null,null,"091"]
["C.A. Specification Limits #8 Sieve:",{"$f":"IF($B$43=2,\"0-10\",IF($B$43=3,\"0-5\",IF($B$43=4,\"0-5\",IF($B$43=5,\"0-5\",\"\"))))","v":""},null,null,null,null,null,null,null,null,null,null,null,null,null,null,null,null,"092"]
["C.A. Specification Limits #200 Sieve:",{"$f":"IF($B$43=2,\"\",IF($E$43=\"\",\"\",IF($E$43=2.5,D43,IF($E$43=1.5,D44))))","v":"0-2.5"},null,null,null,null,null,null,null,null,null,null,null,null,null,null,null,null,"093"]
["I.A. Specification Limits 3/4\" Sieve:",{"$f":"IF(B45=6, \"100\",\"\")","v":""},null,null,null,null,null,null,null,null,null,null,null,null,null,null,null,null,"094"]
["I.A. Specification Limits 1/2\" Sieve:",{"$f":"IF(B45=6, \"90-100\",IF($B$45=2,\"95-100\",\"\"))","v":""},null,null,null,null,null,null,null,null,null,null,null,null,null,null,null,null,"095"]
["I.A. Specification Limits 3/8\" Sieve:",{"$f":"IF(B45=6, \"40-90\",\"\")","v":""},null,null,null,null,null,null,null,null,null,null,null,null,null,null,null,null,"096"]
["I.A. Specification Limits #4 Sieve:",{"$f":"IF(B45=6,\"0-30\",\"\")","v":""},null,null,null,null,null,null,null,null,null,null,null,null,null,null,null,null,"097"]
["I.A. Specification Limits #8 Sieve:",{"$f":"IF(B45=2,\"0-10\",\"\")","v":""},null,null,null,null,null,null,null,null,null,null,null,null,null,null,null,null,"098"]
["I.A. Specification Limits #200 Sieve:",{"$f":"IF(AND(B45=6,E43=1.5), \"0-1.5\", IF(AND(B45=6,E43=2.5), \"0-2.5\",\"\"))","v":""},null,null,null,null,null,null,null,null,null,null,null,null,null,null,null,null,"099"]
["F.A. Specification Limits 3/8\"  Sieve:",{"$f":"IF($B$47=1,\"100\",\"\")","v":""},null,null,null,null,null,null,null,null,null,null,null,null,null,null,null,null,"100"]
["F.A. Specification Limits #4 Sieve:",{"$f":"IF($B$47=1,\"90-100\",IF($B$47=7,\"80-92\",\"\"))","v":""},null,null,null,null,null,null,null,null,null,null,null,null,null,null,null,null,"101"]
["F.A. Specification Limits #8 Sieve:",{"$f":"IF($B$47=1,\"70-100\",IF($B$47=7,\"60-75\",\"\"))","v":""},null,null,null,null,null,null,null,null,null,null,null,null,null,null,null,null,"102"]
["F.A. Specification Limits #30 Sieve:",{"$f":"IF($B$47=1,\"10-60\",IF($B$47=7,\"20-40\",\"\"))","v":""},null,null,null,null,null,null,null,null,null,null,null,null,null,null,null,null,"103"]
["F.A. Specification Limits #200 Sieve:",{"$f":"IF($B$47=1,\"0-1.5\",\"\")","v":""},null,null,null,null,null,null,null,null,null,null,null,null,null,null,null,null,"104"]
["CERTIFIED READY MIX STATEMENT:","Y","Enter Y if certified ready mix item","Y",null,null,null,null,null,null,null,null,null,null,null,null,null,null,"105"]
[null,null,null,"N",null,null,null,null,null,null,null,null,null,null,null,null,null,null,"106"]
[null,null,null,"The PCC mix contains certified materials, approved aggregates, and was produced in compliance with applicable specifications",null,null,null,null,null,null,null,null,null,null,null,null,null,null,"107"]
[null,null,null,null,null,null,null,null,null,null,null,null,null,null,null,null,null,null,"108"]
[null,null,null,null,null,null,null,null,null,null,null,null,null,null,null,null,null,null,"109"]
[null,null,null,null,null,null,null,null,null,null,null,null,null,null,null,null,null,null,"110"]
[null,null,null,null,null,null,null,null,null,null,null,null,null,null,null,null,null,null,"111"]
[null,null,null,null,null,null,null,null,null,null,null,null,null,null,null,null,null,null,"112"]
[null,null,null,null,null,null,null,null,null,null,null,null,null,null,null,null,null,null,"113"]
[null,null,null,null,null,null,null,null,null,null,null,null,null,null,null,null,null,null,"114"]
[null,null,null,null,null,null,null,null,null,null,null,null,null,null,null,null,null,null,"115"]
[null,null,null,null,null,null,null,null,null,null,null,null,null,null,null,null,null,null,"116"]
[null,null,null,null,null,null,null,null,null,null,null,null,null,null,null,null,null,null,"117"]
[null,null,null,null,null,null,null,null,null,null,null,null,null,null,null,null,null,null,"118"]
[null,null,null,null,null,null,null,null,null,null,null,null,null,null,null,null,null,null,"119"]
[null,null,null,null,null,null,null,null,null,null,null,null,null,null,null,null,null,null,"120"]
[null,null,null,null,null,null,null,null,null,null,null,null,null,null,null,null,null,null,"121"]
[null,null,null,null,null,null,null,null,null,null,null,null,null,null,null,null,null,null,"122"]
[null,null,null,null,null,null,null,null,null,null,null,null,null,null,null,null,null,null,"123"]
[null,null,null,null,null,null,null,null,null,null,null,null,null,null,null,null,null,null,"124"]
[null,null,null,null,null,null,null,null,null,null,null,null,null,null,null,null,null,null,"125"]
[null,null,null,null,null,null,null,null,null,null,null,null,null,null,null,null,null,null,"126"]
[null,null,null,null,null,null,null,null,null,null,null,null,null,null,null,null,null,null,"127"]
[null,null,null,null,null,null,null,null,null,null,null,null,null,null,null,null,null,null,"128"]
[null,null,null,null,null,null,null,null,null,null,null,null,null,null,null,null,null,null,"129"]
[null,null,null,null,null,null,null,null,null,null,null,null,null,null,null,null,null,null,"130"]
[null,null,null,null,null,null,null,null,null,null,null,null,null,null,null,null,null,null,"131"]
[null,null,null,null,null,null,null,null,null,null,null,null,null,null,null,null,null,null,"132"]
[null,null,null,null,null,null,null,null,null,null,null,null,null,null,null,null,null,null,"133"]
[null,null,null,null,null,null,null,null,null,null,null,null,null,null,null,null,null,null,"134"]
[null,null,null,null,null,null,null,null,null,null,null,null,null,null,null,null,null,null,"135"]
[null,null,null,null,null,null,null,null,null,null,null,null,null,null,null,null,null,null,"136"]
[null,null,null,null,null,null,null,null,null,null,null,null,null,null,null,null,null,null,"137"]
[null,null,null,null,null,null,null,null,null,null,null,null,null,null,null,null,null,null,"138"]
[null,null,null,null,null,null,null,null,null,null,null,null,null,null,null,null,null,null,"139"]
[null,null,null,null,null,null,null,null,null,null,null,null,null,null,null,null,null,null,"140"]
[null,null,null,null,null,null,null,null,null,null,null,null,null,null,null,null,null,null,"141"]
[null,null,null,null,null,null,null,null,null,null,null,null,null,null,null,null,null,null,"142"]
[null,null,null,null,null,null,null,null,null,null,null,null,null,null,null,null,null,null,"143"]
[null,null,null,null,null,null,null,null,null,null,null,null,null,null,null,null,null,null,"144"]
[null,null,null,null,null,null,null,null,null,null,null,null,null,null,null,null,null,null,"145"]
[null,null,null,null,null,null,null,null,null,null,null,null,null,null,null,null,null,null,"146"]
[null,null,null,null,null,null,null,null,null,null,null,null,null,null,null,null,null,null,"147"]
[null,null,null,null,null,null,null,null,null,null,null,null,null,null,null,null,null,null,"148"]
[null,null,null,null,null,null,null,null,null,null,null,null,null,null,null,null,null,null,"149"]
[null,null,null,null,null,null,null,null,null,null,null,null,null,null,null,null,null,null,"150"]
[null,null,null,null,null,null,null,null,null,null,null,null,null,null,null,null,null,null,"151"]
[null,null,null,null,null,null,null,null,null,null,null,null,null,null,null,null,null,null,"152"]
[null,null,null,null,null,null,null,null,null,null,null,null,null,null,null,null,null,null,"153"]
[null,null,null,null,null,null,null,null,null,null,null,null,null,null,null,null,null,null,"154"]
[null,null,null,null,null,null,null,null,null,null,null,null,null,null,null,null,null,null,"155"]
[null,null,null,null,null,null,null,null,null,null,null,null,null,null,null,null,null,null,"156"]
[null,null,null,null,null,null,null,null,null,null,null,null,null,null,null,null,null,null,"157"]
[null,null,null,null,null,null,null,null,null,null,null,null,null,null,null,null,null,null,"158"]
[null,null,null,null,null,null,null,null,null,null,null,null,null,null,null,null,null,null,"159"]
[null,null,null,null,null,null,null,null,null,null,null,null,null,null,null,null,null,null,"160"]
[null,null,null,null,null,null,null,null,null,null,null,null,null,null,null,null,null,null,"161"]
[null,null,null,null,null,null,null,null,null,null,null,null,null,null,null,null,null,null,"162"]
[null,null,null,null,null,null,null,null,null,null,null,null,null,null,null,null,null,null,"163"]
[null,null,null,null,null,null,null,null,null,null,null,null,null,null,null,null,null,null,"164"]
[null,null,null,null,null,null,null,null,null,null,null,null,null,null,null,null,null,null,"165"]
[null,null,null,null,null,null,null,null,null,null,null,null,null,null,null,null,null,null,"166"]
[null,null,null,null,null,null,null,null,null,null,null,null,null,null,null,null,null,null,"167"]
[null,null,null,null,null,null,null,null,null,null,null,null,null,null,null,null,null,null,"168"]
[null,null,null,null,null,null,null,null,null,null,null,null,null,null,null,null,null,null,"169"]
[null,null,null,null,null,null,null,null,null,null,null,null,null,null,null,null,null,null,"170"]
[null,null,null,null,null,null,null,null,null,null,null,null,null,null,null,null,null,null,"171"]
[null,null,null,null,null,null,null,null,null,null,null,null,null,null,null,null,null,null,"172"]
[null,null,null,null,null,null,null,null,null,null,null,null,null,null,null,null,null,null,"173"]
[null,null,null,null,null,null,null,null,null,null,null,null,null,null,null,null,null,null,"174"]
[null,null,null,null,null,null,null,null,null,null,null,null,null,null,null,null,null,null,"175"]
[null,null,null,null,null,null,null,null,null,null,null,null,null,null,null,null,null,null,"176"]
[null,null,null,null,null,null,null,null,null,null,null,null,null,null,null,null,null,null,"177"]
[null,null,null,null,null,null,null,null,null,null,null,null,null,null,null,null,null,null,"178"]
[null,null,null,null,null,null,null,null,null,null,null,null,null,null,null,null,null,null,"179"]
[null,null,null,null,null,null,null,null,null,null,null,null,null,null,null,null,null,null,"180"]
[null,null,null,null,null,null,null,null,null,null,null,null,null,null,null,null,null,null,"181"]
[null,null,null,null,null,null,null,null,null,null,null,null,null,null,null,null,null,null,"182"]
[null,null,null,null,null,null,null,null,null,null,null,null,null,null,null,null,null,null,"183"]
[null,null,null,null,null,null,null,null,null,null,null,null,null,null,null,null,null,null,"184"]
[null,null,null,null,null,null,null,null,null,null,null,null,null,null,null,null,null,null,"185"]
[null,null,null,null,null,null,null,null,null,null,null,null,null,null,null,null,null,null,"186"]
[null,null,null,null,null,null,null,null,null,null,null,null,null,null,null,null,null,null,"187"]
[null,null,null,null,null,null,null,null,null,null,null,null,null,null,null,null,null,null,"188"]
[null,null,null,null,null,null,null,null,null,null,null,null,null,null,null,null,null,null,"189"]
[null,null,null,null,null,null,null,null,null,null,null,null,null,null,null,null,null,null,"190"]
[null,null,null,null,null,null,null,null,null,null,null,null,null,null,null,null,null,null,"191"]
[null,null,null,null,null,null,null,null,null,null,null,null,null,null,null,null,null,null,"192"]
[null,null,null,null,null,null,null,null,null,null,null,null,null,null,null,null,null,null,"193"]
[null,null,null,null,null,null,null,null,null,null,null,null,null,null,null,null,null,null,"194"]
[null,null,null,null,null,null,null,null,null,null,null,null,null,null,null,null,null,null,"195"]
[null,null,null,null,null,null,null,null,null,null,null,null,null,null,null,null,null,null,"196"]
[null,null,null,null,null,null,null,null,null,null,null,null,null,null,null,null,null,null,"197"]
[null,null,null,null,null,null,null,null,null,null,null,null,null,null,null,null,null,null,"198"]
[null,null,null,null,null,null,null,null,null,null,null,null,null,null,null,null,null,null,"199"]
[null,null,null,null,null,null,null,null,null,null,null,null,null,null,null,null,null,null,"200"]
[null,null,null,null,null,null,null,null,null,null,null,null,null,null,null,null,null,null,"201"]
[null,null,null,null,null,null,null,null,null,null,null,null,null,null,null,null,null,null,"202"]
[null,null,null,null,null,null,null,null,null,null,null,null,null,null,null,null,null,null,"203"]
[null,null,null,null,null,null,null,null,null,null,null,null,null,null,null,null,null,null,"204"]
[null,null,null,null,null,null,null,null,null,null,null,null,null,null,null,null,null,null,"205"]
[null,null,null,null,null,null,null,null,null,null,null,null,null,null,null,null,null,null,"206"]
[null,null,null,null,null,null,null,null,null,null,null,null,null,null,null,null,null,null,"207"]
[null,null,null,null,null,null,null,null,null,null,null,null,null,null,null,null,null,null,"208"]
[null,null,null,null,null,null,null,null,null,null,null,null,null,null,null,null,null,null,"209"]
[null,null,null,null,null,null,null,null,null,null,null,null,null,null,null,null,null,null,"210"]
[null,null,null,null,null,null,null,null,null,null,null,null,null,null,null,null,null,null,"211"]
[null,null,null,null,null,null,null,null,null,null,null,null,null,null,null,null,null,null,"212"]
[null,null,null,null,null,null,null,null,null,null,null,null,null,null,null,null,null,null,"213"]
[null,null,null,null,null,null,null,null,null,null,null,null,null,null,null,null,null,null,"214"]
[null,null,null,null,null,null,null,null,null,null,null,null,null,null,null,null,null,null,"215"]
[null,null,null,null,null,null,null,null,null,null,null,null,null,null,null,null,null,null,"216"]
[null,null,null,null,null,null,null,null,null,null,null,null,null,null,null,null,null,null,"217"]
[null,null,null,null,null,null,null,null,null,null,null,null,null,null,null,null,null,null,"218"]
[null,null,null,null,null,null,null,null,null,null,null,null,null,null,null,null,null,null,"219"]
[null,null,null,null,null,null,null,null,null,null,null,null,null,null,null,null,null,null,"220"]
[null,null,null,null,null,null,null,null,null,null,null,null,null,null,null,null,null,null,"221"]
[null,null,null,null,null,null,null,null,null,null,null,null,null,null,null,null,null,null,"222"]
[null,null,null,null,null,null,null,null,null,null,null,null,null,null,null,null,null,null,"223"]
[null,null,null,null,null,null,null,null,null,null,null,null,null,null,null,null,null,null,"224"]
[null,null,null,null,null,null,null,null,null,null,null,null,null,null,null,null,null,null,"225"]
[null,null,null,null,null,null,null,null,null,null,null,null,null,null,null,null,null,null,"226"]
[null,null,null,null,null,null,null,null,null,null,null,null,null,null,null,null,null,null,"227"]
[null,null,null,null,null,null,null,null,null,null,null,null,null,null,null,null,null,null,"228"]
[null,null,null,null,null,null,null,null,null,null,null,null,null,null,null,null,null,null,"229"]
[null,null,null,null,null,null,null,null,null,null,null,null,null,null,null,null,null,null,"230"]
[null,null,null,null,null,null,null,null,null,null,null,null,null,null,null,null,null,null,"231"]
[null,null,null,null,null,null,null,null,null,null,null,null,null,null,null,null,null,null,"232"]
[null,null,null,null,null,null,null,null,null,null,null,null,null,null,null,null,null,null,"233"]
[null,null,null,null,null,null,null,null,null,null,null,null,null,null,null,null,null,null,"234"]
[null,null,null,null,null,null,null,null,null,null,null,null,null,null,null,null,null,null,"235"]
[null,null,null,null,null,null,null,null,null,null,null,null,null,null,null,null,null,null,"236"]
[null,null,null,null,null,null,null,null,null,null,null,null,null,null,null,null,null,null,"237"]
[null,null,null,null,null,null,null,null,null,null,null,null,null,null,null,null,null,null,"238"]
[null,null,null,null,null,null,null,null,null,null,null,null,null,null,null,null,null,null,"239"]
[null,null,null,null,null,null,null,null,null,null,null,null,null,null,null,null,null,null,"240"]
[null,null,null,null,null,null,null,null,null,null,null,null,null,null,null,null,null,null,"241"]
[null,null,null,null,null,null,null,null,null,null,null,null,null,null,null,null,null,null,"242"]
[null,null,null,null,null,null,null,null,null,null,null,null,null,null,null,null,null,null,"243"]
[null,null,null,null,null,null,null,null,null,null,null,null,null,null,null,null,null,null,"244"]
[null,null,null,null,null,null,null,null,null,null,null,null,null,null,null,null,null,null,"245"]
[null,null,null,null,null,null,null,null,null,null,null,null,null,null,null,null,null,null,"246"]
[null,null,null,null,null,null,null,null,null,null,null,null,null,null,null,null,null,null,"247"]
[null,null,null,null,null,null,null,null,null,null,null,null,null,null,null,null,null,null,"248"]
[null,null,null,null,null,null,null,null,null,null,null,null,null,null,null,null,null,null,"249"]
[null,null,null,null,null,null,null,null,null,null,null,null,null,null,null,null,null,null,"250"]
[null,null,null,null,null,null,null,null,null,null,null,null,null,null,null,null,null,null,"251"]
[null,null,null,null,null,null,null,null,null,null,null,null,null,null,null,null,null,null,"252"]
[null,null,null,null,null,null,null,null,null,null,null,null,null,null,null,null,null,null,"253"]
[null,null,null,null,null,null,null,null,null,null,null,null,null,null,null,null,null,null,"254"]
[null,null,null,null,null,null,null,null,null,null,null,null,null,null,null,null,null,null,"255"]
[null,null,null,null,null,null,null,null,null,null,null,null,null,null,null,null,null,null,"256"]
[null,null,null,null,null,null,null,null,null,null,null,null,null,null,null,null,null,null,"257"]
[null,null,null,null,null,null,null,null,null,null,null,null,null,null,null,null,null,null,"258"]
[null,null,null,null,null,null,null,null,null,null,null,null,null,null,null,null,null,null,"259"]
[null,null,null,null,null,null,null,null,null,null,null,null,null,null,null,null,null,null,"260"]
[null,null,null,null,null,null,null,null,null,null,null,null,null,null,null,null,null,null,"261"]
[null,null,null,null,null,null,null,null,null,null,null,null,null,null,null,null,null,null,"262"]
[null,null,null,null,null,null,null,null,null,null,null,null,null,null,null,null,null,null,"263"]
[null,null,null,null,null,null,null,null,null,null,null,null,null,null,null,null,null,null,"264"]
[null,null,null,null,null,null,null,null,null,null,null,null,null,null,null,null,null,null,"265"]
[null,null,null,null,null,null,null,null,null,null,null,null,null,null,null,null,null,null,"266"]
[null,null,null,null,null,null,null,null,null,null,null,null,null,null,null,null,null,null,"267"]
[null,null,null,null,null,null,null,null,null,null,null,null,null,null,null,null,null,null,"268"]
[null,null,null,null,null,null,null,null,null,null,null,null,null,null,null,null,null,null,"269"]
[null,null,null,null,null,null,null,null,null,null,null,null,null,null,null,null,null,null,"270"]
[null,null,null,null,null,null,null,null,null,null,null,null,null,null,null,null,null,null,"271"]
[null,null,null,null,null,null,null,null,null,null,null,null,null,null,null,null,null,null,"272"]
[null,null,null,null,null,null,null,null,null,null,null,null,null,null,null,null,null,null,"273"]
[null,null,null,null,null,null,null,null,null,null,null,null,null,null,null,null,null,null,"274"]
[null,null,null,null,null,null,null,null,null,null,null,null,null,null,null,null,null,null,"275"]
[null,null,null,null,null,null,null,null,null,null,null,null,null,null,null,null,null,null,"276"]
[null,null,null,null,null,null,null,null,null,null,null,null,null,null,null,null,null,null,"277"]
[null,null,null,null,null,null,null,null,null,null,null,null,null,null,null,null,null,null,"278"]
[null,null,null,null,null,null,null,null,null,null,null,null,null,null,null,null,null,null,"279"]
[null,null,null,null,null,null,null,null,null,null,null,null,null,null,null,null,null,null,"280"]
[null,null,null,null,null,null,null,null,null,null,null,null,null,null,null,null,null,null,"281"]
[null,null,null,null,null,null,null,null,null,null,null,null,null,null,null,null,null,null,"282"]
[null,null,null,null,null,null,null,null,null,null,null,null,null,null,null,null,null,null,"283"]
[null,null,null,null,null,null,null,null,null,null,null,null,null,null,null,null,null,null,"284"]
[null,null,null,null,null,null,null,null,null,null,null,null,null,null,null,null,null,null,"285"]
[null,null,null,null,null,null,null,null,null,null,null,null,null,null,null,null,null,null,"286"]
[null,null,null,null,null,null,null,null,null,null,null,null,null,null,null,null,null,null,"287"]
[null,null,null,null,null,null,null,null,null,null,null,null,null,null,null,null,null,null,"288"]
[null,null,null,null,null,null,null,null,null,null,null,null,null,null,null,null,null,null,"289"]
[null,null,null,null,null,null,null,null,null,null,null,null,null,null,null,null,null,null,"290"]
[null,null,null,null,null,null,null,null,null,null,null,null,null,null,null,null,null,null,"291"]
[null,null,null,null,null,null,null,null,null,null,null,null,null,null,null,null,null,null,"292"]
[null,null,null,null,null,null,null,null,null,null,null,null,null,null,null,null,null,null,"293"]
[null,null,null,null,null,null,null,null,null,null,null,null,null,null,null,null,null,null,"294"]
[null,null,null,null,null,null,null,null,null,null,null,null,null,null,null,null,null,null,"295"]
[null,null,null,null,null,null,null,null,null,null,null,null,null,null,null,null,null,null,"296"]
[null,null,null,null,null,null,null,null,null,null,null,null,null,null,null,null,null,null,"297"]
[null,null,null,null,null,null,null,null,null,null,null,null,null,null,null,null,null,null,"298"]
[null,null,null,null,null,null,null,null,null,null,null,null,null,null,null,null,null,null,"299"]
[null,null,null,null,null,null,null,null,null,null,null,null,null,null,null,null,null,null,"300"]
[null,null,null,null,null,null,null,null,null,null,null,null,null,null,null,null,null,null,"301"]
[null,null,null,null,null,null,null,null,null,null,null,null,null,null,null,null,null,null,"302"]
[null,null,null,null,null,null,null,null,null,null,null,null,null,null,null,null,null,null,"303"]
[null,null,null,null,null,null,null,null,null,null,null,null,null,null,null,null,null,null,"304"]
[null,null,null,null,null,null,null,null,null,null,null,null,null,null,null,null,null,null,"305"]
[null,null,null,null,null,null,null,null,null,null,null,null,null,null,null,null,null,null,"306"]
[null,null,null,null,null,null,null,null,null,null,null,null,null,null,null,null,null,null,"307"]
[null,null,null,null,null,null,null,null,null,null,null,null,null,null,null,null,null,null,"308"]
[null,null,null,null,null,null,null,null,null,null,null,null,null,null,null,null,null,null,"309"]
[null,null,null,null,null,null,null,null,null,null,null,null,null,null,null,null,null,null,"310"]
[null,null,null,null,null,null,null,null,null,null,null,null,null,null,null,null,null,null,"311"]
[null,null,null,null,null,null,null,null,null,null,null,null,null,null,null,null,null,null,"312"]
[null,null,null,null,null,null,null,null,null,null,null,null,null,null,null,null,null,null,"313"]
[null,null,null,null,null,null,null,null,null,null,null,null,null,null,null,null,null,null,"314"]
[null,null,null,null,null,null,null,null,null,null,null,null,null,null,null,null,null,null,"315"]
[null,null,null,null,null,null,null,null,null,null,null,null,null,null,null,null,null,null,"316"]
[null,null,null,null,null,null,null,null,null,null,null,null,null,null,null,null,null,null,"317"]
[null,null,null,null,null,null,null,null,null,null,null,null,null,null,null,null,null,null,"318"]
[null,null,null,null,null,null,null,null,null,null,null,null,null,null,null,null,null,null,"319"]
[null,null,null,null,null,null,null,null,null,null,null,null,null,null,null,null,null,null,"320"]
[null,null,null,null,null,null,null,null,null,null,null,null,null,null,null,null,null,null,"321"]
[null,null,null,null,null,null,null,null,null,null,null,null,null,null,null,null,null,null,"322"]
[null,null,null,null,null,null,null,null,null,null,null,null,null,null,null,null,null,null,"323"]
[null,null,null,null,null,null,null,null,null,null,null,null,null,null,null,null,null,null,"324"]
[null,null,null,null,null,null,null,null,null,null,null,null,null,null,null,null,null,null,"325"]
[null,null,null,null,null,null,null,null,null,null,null,null,null,null,null,null,null,null,"326"]
[null,null,null,null,null,null,null,null,null,null,null,null,null,null,null,null,null,null,"327"]
[null,null,null,null,null,null,null,null,null,null,null,null,null,null,null,null,null,null,"328"]
[null,null,null,null,null,null,null,null,null,null,null,null,null,null,null,null,null,null,"329"]
[null,null,null,null,null,null,null,null,null,null,null,null,null,null,null,null,null,null,"330"]
[null,null,null,null,null,null,null,null,null,null,null,null,null,null,null,null,null,null,"331"]
[null,null,null,null,null,null,null,null,null,null,null,null,null,null,null,null,null,null,"332"]
[null,null,null,null,null,null,null,null,null,null,null,null,null,null,null,null,null,null,"333"]
[null,null,null,null,null,null,null,null,null,null,null,null,null,null,null,null,null,null,"334"]
[null,null,null,null,null,null,null,null,null,null,null,null,null,null,null,null,null,null,"335"]
[null,null,null,null,null,null,null,null,null,null,null,null,null,null,null,null,null,null,"336"]
[null,null,null,null,null,null,null,null,null,null,null,null,null,null,null,null,null,null,"337"]
[null,null,null,null,null,null,null,null,null,null,null,null,null,null,null,null,null,null,"338"]
[null,null,null,null,null,null,null,null,null,null,null,null,null,null,null,null,null,null,"339"]
[null,null,null,null,null,null,null,null,null,null,null,null,null,null,null,null,null,null,"340"]
[null,null,null,null,null,null,null,null,null,null,null,null,null,null,null,null,null,null,"341"]
[null,null,null,null,null,null,null,null,null,null,null,null,null,null,null,null,null,null,"342"]
[null,null,null,null,null,null,null,null,null,null,null,null,null,null,null,null,null,null,"343"]
[null,null,null,null,null,null,null,null,null,null,null,null,null,null,null,null,null,null,"344"]
[null,null,null,null,null,null,null,null,null,null,null,null,null,null,null,null,null,null,"345"]
[null,null,null,null,null,null,null,null,null,null,null,null,null,null,null,null,null,null,"346"]
[null,null,null,null,null,null,null,null,null,null,null,null,null,null,null,null,null,null,"347"]
[null,null,null,null,null,null,null,null,null,null,null,null,null,null,null,null,null,null,"348"]
[null,null,null,null,null,null,null,null,null,null,null,null,null,null,null,null,null,null,"349"]
[null,null,null,null,null,null,null,null,null,null,null,null,null,null,null,null,null,null,"350"]
[null,null,null,null,null,null,null,null,null,null,null,null,null,null,null,null,null,null,"351"]
[null,null,null,null,null,null,null,null,null,null,null,null,null,null,null,null,null,null,"352"]
[null,null,null,null,null,null,null,null,null,null,null,null,null,null,null,null,null,null,"353"]
[null,null,null,null,null,null,null,null,null,null,null,null,null,null,null,null,null,null,"354"]
[null,null,null,null,null,null,null,null,null,null,null,null,null,null,null,null,null,null,"355"]
[null,null,null,null,null,null,null,null,null,null,null,null,null,null,null,null,null,null,"356"]
[null,null,null,null,null,null,null,null,null,null,null,null,null,null,null,null,null,null,"357"]
[null,null,null,null,null,null,null,null,null,null,null,null,null,null,null,null,null,null,"358"]
[null,null,null,null,null,null,null,null,null,null,null,null,null,null,null,null,null,null,"359"]
[null,null,null,null,null,null,null,null,null,null,null,null,null,null,null,null,null,null,"360"]
[null,null,null,null,null,null,null,null,null,null,null,null,null,null,null,null,null,null,"361"]
[null,null,null,null,null,null,null,null,null,null,null,null,null,null,null,null,null,null,"362"]
[null,null,null,null,null,null,null,null,null,null,null,null,null,null,null,null,null,null,"363"]
[null,null,null,null,null,null,null,null,null,null,null,null,null,null,null,null,null,null,"364"]
[null,null,null,null,null,null,null,null,null,null,null,null,null,null,null,null,null,null,"365"]
[null,null,null,null,null,null,null,null,null,null,null,null,null,null,null,null,null,null,"366"]
[null,null,null,null,null,null,null,null,null,null,null,null,null,null,null,null,null,null,"367"]
[null,null,null,null,null,null,null,null,null,null,null,null,null,null,null,null,null,null,"368"]
[null,null,null,null,null,null,null,null,null,null,null,null,null,null,null,null,null,null,"369"]
[null,null,null,null,null,null,null,null,null,null,null,null,null,null,null,null,null,null,"370"]
[null,null,null,null,null,null,null,null,null,null,null,null,null,null,null,null,null,null,"371"]
[null,null,null,null,null,null,null,null,null,null,null,null,null,null,null,null,null,null,"372"]
[null,null,null,null,null,null,null,null,null,null,null,null,null,null,null,null,null,null,"373"]
[null,null,null,null,null,null,null,null,null,null,null,null,null,null,null,null,null,null,"374"]
[null,null,null,null,null,null,null,null,null,null,null,null,null,null,null,null,null,null,"375"]
[null,null,null,null,null,null,null,null,null,null,null,null,null,null,null,null,null,null,"376"]
[null,null,null,null,null,null,null,null,null,null,null,null,null,null,null,null,null,null,"377"]
[null,null,null,null,null,null,null,null,null,null,null,null,null,null,null,null,null,null,"378"]
[null,null,null,null,null,null,null,null,null,null,null,null,null,null,null,null,null,null,"379"]
[null,null,null,null,null,null,null,null,null,null,null,null,null,null,null,null,null,null,"380"]
[null,null,null,null,null,null,null,null,null,null,null,null,null,null,null,null,null,null,"381"]
[null,null,null,null,null,null,null,null,null,null,null,null,null,null,null,null,null,null,"382"]
[null,null,null,null,null,null,null,null,null,null,null,null,null,null,null,null,null,null,"383"]
[null,null,null,null,null,null,null,null,null,null,null,null,null,null,null,null,null,null,"384"]
[null,null,null,null,null,null,null,null,null,null,null,null,null,null,null,null,null,null,"385"]
[null,null,null,null,null,null,null,null,null,null,null,null,null,null,null,null,null,null,"386"]
[null,null,null,null,null,null,null,null,null,null,null,null,null,null,null,null,null,null,"387"]
[null,null,null,null,null,null,null,null,null,null,null,null,null,null,null,null,null,null,"388"]
[null,null,null,null,null,null,null,null,null,null,null,null,null,null,null,null,null,null,"389"]
[null,null,null,null,null,null,null,null,null,null,null,null,null,null,null,null,null,null,"390"]
[null,null,null,null,null,null,null,null,null,null,null,null,null,null,null,null,null,null,"391"]
[null,null,null,null,null,null,null,null,null,null,null,null,null,null,null,null,null,null,"392"]
[null,null,null,null,null,null,null,null,null,null,null,null,null,null,null,null,null,null,"393"]
[null,null,null,null,null,null,null,null,null,null,null,null,null,null,null,null,null,null,"394"]
[null,null,null,null,null,null,null,null,null,null,null,null,null,null,null,null,null,null,"395"]
[null,null,null,null,null,null,null,null,null,null,null,null,null,null,null,null,null,null,"396"]
[null,null,null,null,null,null,null,null,null,null,null,null,null,null,null,null,null,null,"397"]
[null,null,null,null,null,null,null,null,null,null,null,null,null,null,null,null,null,null,"398"]
[null,null,null,null,null,null,null,null,null,null,null,null,null,null,null,null,null,null,"399"]
[null,null,null,null,null,null,null,null,null,null,null,null,null,null,null,null,null,null,"400"]
[null,null,null,null,null,null,null,null,null,null,null,null,null,null,null,null,null,null,"401"]
[null,null,null,null,null,null,null,null,null,null,null,null,null,null,null,null,null,null,"402"]
[null,null,null,null,null,null,null,null,null,null,null,null,null,null,null,null,null,null,"403"]
[null,null,null,null,null,null,null,null,null,null,null,null,null,null,null,null,null,null,"404"]
[null,null,null,null,null,null,null,null,null,null,null,null,null,null,null,null,null,null,"405"]
[null,null,null,null,null,null,null,null,null,null,null,null,null,null,null,null,null,null,"406"]
[null,null,null,null,null,null,null,null,null,null,null,null,null,null,null,null,null,null,"407"]
[null,null,null,null,null,null,null,null,null,null,null,null,null,null,null,null,null,null,"408"]
[null,null,null,null,null,null,null,null,null,null,null,null,null,null,null,null,null,null,"409"]
[null,null,null,null,null,null,null,null,null,null,null,null,null,null,null,null,null,null,"410"]
[null,null,null,null,null,null,null,null,null,null,null,null,null,null,null,null,null,null,"411"]
[null,null,null,null,null,null,null,null,null,null,null,null,null,null,null,null,null,null,"412"]
[null,null,null,null,null,null,null,null,null,null,null,null,null,null,null,null,null,null,"413"]
[null,null,null,null,null,null,null,null,null,null,null,null,null,null,null,null,null,null,"414"]
[null,null,null,null,null,null,null,null,null,null,null,null,null,null,null,null,null,null,"415"]
[null,null,null,null,null,null,null,null,null,null,null,null,null,null,null,null,null,null,"416"]
[null,null,null,null,null,null,null,null,null,null,null,null,null,null,null,null,null,null,"417"]
[null,null,null,null,null,null,null,null,null,null,null,null,null,null,null,null,null,null,"418"]
[null,null,null,null,null,null,null,null,null,null,null,null,null,null,null,null,null,null,"419"]
[null,null,null,null,null,null,null,null,null,null,null,null,null,null,null,null,null,null,"420"]
[null,null,null,null,null,null,null,null,null,null,null,null,null,null,null,null,null,null,"421"]
[null,null,null,null,null,null,null,null,null,null,null,null,null,null,null,null,null,null,"422"]
[null,null,null,null,null,null,null,null,null,null,null,null,null,null,null,null,null,null,"423"]
[null,null,null,null,null,null,null,null,null,null,null,null,null,null,null,null,null,null,"424"]
[null,null,null,null,null,null,null,null,null,null,null,null,null,null,null,null,null,null,"425"]
[null,null,null,null,null,null,null,null,null,null,null,null,null,null,null,null,null,null,"426"]
[null,null,null,null,null,null,null,null,null,null,null,null,null,null,null,null,null,null,"427"]
[null,null,null,null,null,null,null,null,null,null,null,null,null,null,null,null,null,null,"428"]
[null,null,null,null,null,null,null,null,null,null,null,null,null,null,null,null,null,null,"429"]
[null,null,null,null,null,null,null,null,null,null,null,null,null,null,null,null,null,null,"430"]
[null,null,null,null,null,null,null,null,null,null,null,null,null,null,null,null,null,null,"431"]
[null,null,null,null,null,null,null,null,null,null,null,null,null,null,null,null,null,null,"432"]
[null,null,null,null,null,null,null,null,null,null,null,null,null,null,null,null,null,null,"433"]
[null,null,null,null,null,null,null,null,null,null,null,null,null,null,null,null,null,null,"434"]
[null,null,null,null,null,null,null,null,null,null,null,null,null,null,null,null,null,null,"435"]
[null,null,null,null,null,null,null,null,null,null,null,null,null,null,null,null,null,null,"436"]
[null,null,null,null,null,null,null,null,null,null,null,null,null,null,null,null,null,null,"437"]
[null,null,null,null,null,null,null,null,null,null,null,null,null,null,null,null,null,null,"438"]
[null,null,null,null,null,null,null,null,null,null,null,null,null,null,null,null,null,null,"439"]
[null,null,null,null,null,null,null,null,null,null,null,null,null,null,null,null,null,null,"440"]
[null,null,null,null,null,null,null,null,null,null,null,null,null,null,null,null,null,null,"441"]
[null,null,null,null,null,null,null,null,null,null,null,null,null,null,null,null,null,null,"442"]
[null,null,null,null,null,null,null,null,null,null,null,null,null,null,null,null,null,null,"443"]
[null,null,null,null,null,null,null,null,null,null,null,null,null,null,null,null,null,null,"444"]
[null,null,null,null,null,null,null,null,null,null,null,null,null,null,null,null,null,null,"445"]
[null,null,null,null,null,null,null,null,null,null,null,null,null,null,null,null,null,null,"446"]
[null,null,null,null,null,null,null,null,null,null,null,null,null,null,null,null,null,null,"447"]
[null,null,null,null,null,null,null,null,null,null,null,null,null,null,null,null,null,null,"448"]
[null,null,null,null,null,null,null,null,null,null,null,null,null,null,null,null,null,null,"449"]
[null,null,null,null,null,null,null,null,null,null,null,null,null,null,null,null,null,null,"450"]
[null,null,null,null,null,null,null,null,null,null,null,null,null,null,null,null,null,null,"451"]
[null,null,null,null,null,null,null,null,null,null,null,null,null,null,null,null,null,null,"452"]
[null,null,null,null,null,null,null,null,null,null,null,null,null,null,null,null,null,null,"453"]
[null,null,null,null,null,null,null,null,null,null,null,null,null,null,null,null,null,null,"454"]
[null,null,null,null,null,null,null,null,null,null,null,null,null,null,null,null,null,null,"455"]
[null,null,null,null,null,null,null,null,null,null,null,null,null,null,null,null,null,null,"456"]
[null,null,null,null,null,null,null,null,null,null,null,null,null,null,null,null,null,null,"457"]
[null,null,null,null,null,null,null,null,null,null,null,null,null,null,null,null,null,null,"458"]
[null,null,null,null,null,null,null,null,null,null,null,null,null,null,null,null,null,null,"459"]
[null,null,null,null,null,null,null,null,null,null,null,null,null,null,null,null,null,null,"460"]
[null,null,null,null,null,null,null,null,null,null,null,null,null,null,null,null,null,null,"461"]
[null,null,null,null,null,null,null,null,null,null,null,null,null,null,null,null,null,null,"462"]
[null,null,null,null,null,null,null,null,null,null,null,null,null,null,null,null,null,null,"463"]
[null,null,null,null,null,null,null,null,null,null,null,null,null,null,null,null,null,null,"464"]
[null,null,null,null,null,null,null,null,null,null,null,null,null,null,null,null,null,null,"465"]
[null,null,null,null,null,null,null,null,null,null,null,null,null,null,null,null,null,null,"466"]
[null,null,null,null,null,null,null,null,null,null,null,null,null,null,null,null,null,null,"467"]
[null,null,null,null,null,null,null,null,null,null,null,null,null,null,null,null,null,null,"468"]
[null,null,null,null,null,null,null,null,null,null,null,null,null,null,null,null,null,null,"469"]
[null,null,null,null,null,null,null,null,null,null,null,null,null,null,null,null,null,null,"470"]
[null,null,null,null,null,null,null,null,null,null,null,null,null,null,null,null,null,null,"471"]
[null,null,null,null,null,null,null,null,null,null,null,null,null,null,null,null,null,null,"472"]
[null,null,null,null,null,null,null,null,null,null,null,null,null,null,null,null,null,null,"473"]
[null,null,null,null,null,null,null,null,null,null,null,null,null,null,null,null,null,null,"474"]
[null,null,null,null,null,null,null,null,null,null,null,null,null,null,null,null,null,null,"475"]
[null,null,null,null,null,null,null,null,null,null,null,null,null,null,null,null,null,null,"476"]
[null,null,null,null,null,null,null,null,null,null,null,null,null,null,null,null,null,null,"477"]
[null,null,null,null,null,null,null,null,null,null,null,null,null,null,null,null,null,null,"478"]
[null,null,null,null,null,null,null,null,null,null,null,null,null,null,null,null,null,null,"479"]
[null,null,null,null,null,null,null,null,null,null,null,null,null,null,null,null,null,null,"480"]
[null,null,null,null,null,null,null,null,null,null,null,null,null,null,null,null,null,null,"481"]
[null,null,null,null,null,null,null,null,null,null,null,null,null,null,null,null,null,null,"482"]
[null,null,null,null,null,null,null,null,null,null,null,null,null,null,null,null,null,null,"483"]
[null,null,null,null,null,null,null,null,null,null,null,null,null,null,null,null,null,null,"484"]
[null,null,null,null,null,null,null,null,null,null,null,null,null,null,null,null,null,null,"485"]
[null,null,null,null,null,null,null,null,null,null,null,null,null,null,null,null,null,null,"486"]
[null,null,null,null,null,null,null,null,null,null,null,null,null,null,null,null,null,null,"487"]
[null,null,null,null,null,null,null,null,null,null,null,null,null,null,null,null,null,null,"488"]
[null,null,null,null,null,null,null,null,null,null,null,null,null,null,null,null,null,null,"489"]
[null,null,null,null,null,null,null,null,null,null,null,null,null,null,null,null,null,null,"490"]
[null,null,null,null,null,null,null,null,null,null,null,null,null,null,null,null,null,null,"491"]
[null,null,null,null,null,null,null,null,null,null,null,null,null,null,null,null,null,null,"492"]
[null,null,null,null,null,null,null,null,null,null,null,null,null,null,null,null,null,null,"493"]
[null,null,null,null,null,null,null,null,null,null,null,null,null,null,null,null,null,null,"494"]
[null,null,null,null,null,null,null,null,null,null,null,null,null,null,null,null,null,null,"495"]
[null,null,null,null,null,null,null,null,null,null,null,null,null,null,null,null,null,null,"496"]
[null,null,null,null,null,null,null,null,null,null,null,null,null,null,null,null,null,null,"497"]
[null,null,null,null,null,null,null,null,null,null,null,null,null,null,null,null,null,null,"498"]
[null,null,null,null,null,null,null,null,null,null,null,null,null,null,null,null,null,null,"499"]
[null,null,null,null,null,null,null,null,null,null,null,null,null,null,null,null,null,null,"500"]
[null,null,null,null,null,null,null,null,null,null,null,null,null,null,null,null,null,null,"501"]
[null,null,null,null,null,null,null,null,null,null,null,null,null,null,null,null,null,null,"502"]
[null,null,null,null,null,null,null,null,null,null,null,null,null,null,null,null,null,null,"503"]
[null,null,null,null,null,null,null,null,null,null,null,null,null,null,null,null,null,null,"504"]
[null,null,null,null,null,null,null,null,null,null,null,null,null,null,null,null,null,null,"505"]
[null,null,null,null,null,null,null,null,null,null,null,null,null,null,null,null,null,null,"506"]
[null,null,null,null,null,null,null,null,null,null,null,null,null,null,null,null,null,null,"507"]
[null,null,null,null,null,null,null,null,null,null,null,null,null,null,null,null,null,null,"508"]
[null,null,null,null,null,null,null,null,null,null,null,null,null,null,null,null,null,null,"509"]
[null,null,null,null,null,null,null,null,null,null,null,null,null,null,null,null,null,null,"510"]
[null,null,null,null,null,null,null,null,null,null,null,null,null,null,null,null,null,null,"511"]
[null,null,null,null,null,null,null,null,null,null,null,null,null,null,null,null,null,null,"512"]
[null,null,null,null,null,null,null,null,null,null,null,null,null,null,null,null,null,null,"513"]
[null,null,null,null,null,null,null,null,null,null,null,null,null,null,null,null,null,null,"514"]
[null,null,null,null,null,null,null,null,null,null,null,null,null,null,null,null,null,null,"515"]
[null,null,null,null,null,null,null,null,null,null,null,null,null,null,null,null,null,null,"516"]
[null,null,null,null,null,null,null,null,null,null,null,null,null,null,null,null,null,null,"517"]
[null,null,null,null,null,null,null,null,null,null,null,null,null,null,null,null,null,null,"518"]
[null,null,null,null,null,null,null,null,null,null,null,null,null,null,null,null,null,null,"519"]
[null,null,null,null,null,null,null,null,null,null,null,null,null,null,null,null,null,null,"520"]
[null,null,null,null,null,null,null,null,null,null,null,null,null,null,null,null,null,null,"521"]
[null,null,null,null,null,null,null,null,null,null,null,null,null,null,null,null,null,null,"522"]
[null,null,null,null,null,null,null,null,null,null,null,null,null,null,null,null,null,null,"523"]
[null,null,null,null,null,null,null,null,null,null,null,null,null,null,null,null,null,null,"524"]
[null,null,null,null,null,null,null,null,null,null,null,null,null,null,null,null,null,null,"525"]
[null,null,null,null,null,null,null,null,null,null,null,null,null,null,null,null,null,null,"526"]
[null,null,null,null,null,null,null,null,null,null,null,null,null,null,null,null,null,null,"527"]
[null,null,null,null,null,null,null,null,null,null,null,null,null,null,null,null,null,null,"528"]
[null,null,null,null,null,null,null,null,null,null,null,null,null,null,null,null,null,null,"529"]
[null,null,null,null,null,null,null,null,null,null,null,null,null,null,null,null,null,null,"530"]
[null,null,null,null,null,null,null,null,null,null,null,null,null,null,null,null,null,null,"531"]
[null,null,null,null,null,null,null,null,null,null,null,null,null,null,null,null,null,null,"532"]
[null,null,null,null,null,null,null,null,null,null,null,null,null,null,null,null,null,null,"533"]
[null,null,null,null,null,null,null,null,null,null,null,null,null,null,null,null,null,null,"534"]
[null,null,null,null,null,null,null,null,null,null,null,null,null,null,null,null,null,null,"535"]
[null,null,null,null,null,null,null,null,null,null,null,null,null,null,null,null,null,null,"536"]
[null,null,null,null,null,null,null,null,null,null,null,null,null,null,null,null,null,null,"537"]
[null,null,null,null,null,null,null,null,null,null,null,null,null,null,null,null,null,null,"538"]
[null,null,null,null,null,null,null,null,null,null,null,null,null,null,null,null,null,null,"539"]
[null,null,null,null,null,null,null,null,null,null,null,null,null,null,null,null,null,null,"540"]
[null,null,null,null,null,null,null,null,null,null,null,null,null,null,null,null,null,null,"541"]
[null,null,null,null,null,null,null,null,null,null,null,null,null,null,null,null,null,null,"542"]
[null,null,null,null,null,null,null,null,null,null,null,null,null,null,null,null,null,null,"543"]
[null,null,null,null,null,null,null,null,null,null,null,null,null,null,null,null,null,null,"544"]
[null,null,null,null,null,null,null,null,null,null,null,null,null,null,null,null,null,null,"545"]
[null,null,null,null,null,null,null,null,null,null,null,null,null,null,null,null,null,null,"546"]
[null,null,null,null,null,null,null,null,null,null,null,null,null,null,null,null,null,null,"547"]
[null,null,null,null,null,null,null,null,null,null,null,null,null,null,null,null,null,null,"548"]
[null,null,null,null,null,null,null,null,null,null,null,null,null,null,null,null,null,null,"549"]
[null,null,null,null,null,null,null,null,null,null,null,null,null,null,null,null,null,null,"550"]
[null,null,null,null,null,null,null,null,null,null,null,null,null,null,null,null,null,null,"551"]
[null,null,null,null,null,null,null,null,null,null,null,null,null,null,null,null,null,null,"552"]
[null,null,null,null,null,null,null,null,null,null,null,null,null,null,null,null,null,null,"553"]
[null,null,null,null,null,null,null,null,null,null,null,null,null,null,null,null,null,null,"554"]
[null,null,null,null,null,null,null,null,null,null,null,null,null,null,null,null,null,null,"555"]
[null,null,null,null,null,null,null,null,null,null,null,null,null,null,null,null,null,null,"556"]
[null,null,null,null,null,null,null,null,null,null,null,null,null,null,null,null,null,null,"557"]
[null,null,null,null,null,null,null,null,null,null,null,null,null,null,null,null,null,null,"558"]
[null,null,null,null,null,null,null,null,null,null,null,null,null,null,null,null,null,null,"559"]
[null,null,null,null,null,null,null,null,null,null,null,null,null,null,null,null,null,null,"560"]
[null,null,null,null,null,null,null,null,null,null,null,null,null,null,null,null,null,null,"561"]
[null,null,null,null,null,null,null,null,null,null,null,null,null,null,null,null,null,null,"562"]
[null,null,null,null,null,null,null,null,null,null,null,null,null,null,null,null,null,null,"563"]
[null,null,null,null,null,null,null,null,null,null,null,null,null,null,null,null,null,null,"564"]
[null,null,null,null,null,null,null,null,null,null,null,null,null,null,null,null,null,null,"565"]
[null,null,null,null,null,null,null,null,null,null,null,null,null,null,null,null,null,null,"566"]
[null,null,null,null,null,null,null,null,null,null,null,null,null,null,null,null,null,null,"567"]
[null,null,null,null,null,null,null,null,null,null,null,null,null,null,null,null,null,null,"568"]
[null,null,null,null,null,null,null,null,null,null,null,null,null,null,null,null,null,null,"569"]
[null,null,null,null,null,null,null,null,null,null,null,null,null,null,null,null,null,null,"570"]
[null,null,null,null,null,null,null,null,null,null,null,null,null,null,null,null,null,null,"571"]
[null,null,null,null,null,null,null,null,null,null,null,null,null,null,null,null,null,null,"572"]
[null,null,null,null,null,null,null,null,null,null,null,null,null,null,null,null,null,null,"573"]
[null,null,null,null,null,null,null,null,null,null,null,null,null,null,null,null,null,null,"574"]
[null,null,null,null,null,null,null,null,null,null,null,null,null,null,null,null,null,null,"575"]
[null,null,null,null,null,null,null,null,null,null,null,null,null,null,null,null,null,null,"576"]
[null,null,null,null,null,null,null,null,null,null,null,null,null,null,null,null,null,null,"577"]
[null,null,null,null,null,null,null,null,null,null,null,null,null,null,null,null,null,null,"578"]
[null,null,null,null,null,null,null,null,null,null,null,null,null,null,null,null,null,null,"579"]
[null,null,null,null,null,null,null,null,null,null,null,null,null,null,null,null,null,null,"580"]
[null,null,null,null,null,null,null,null,null,null,null,null,null,null,null,null,null,null,"581"]
[null,null,null,null,null,null,null,null,null,null,null,null,null,null,null,null,null,null,"582"]
[null,null,null,null,null,null,null,null,null,null,null,null,null,null,null,null,null,null,"583"]
[null,null,null,null,null,null,null,null,null,null,null,null,null,null,null,null,null,null,"584"]
[null,null,null,null,null,null,null,null,null,null,null,null,null,null,null,null,null,null,"585"]
[null,null,null,null,null,null,null,null,null,null,null,null,null,null,null,null,null,null,"586"]
[null,null,null,null,null,null,null,null,null,null,null,null,null,null,null,null,null,null,"587"]
[null,null,null,null,null,null,null,null,null,null,null,null,null,null,null,null,null,null,"588"]
[null,null,null,null,null,null,null,null,null,null,null,null,null,null,null,null,null,null,"589"]
[null,null,null,null,null,null,null,null,null,null,null,null,null,null,null,null,null,null,"590"]
[null,null,null,null,null,null,null,null,null,null,null,null,null,null,null,null,null,null,"591"]
[null,null,null,null,null,null,null,null,null,null,null,null,null,null,null,null,null,null,"592"]
[null,null,null,null,null,null,null,null,null,null,null,null,null,null,null,null,null,null,"593"]
[null,null,null,null,null,null,null,null,null,null,null,null,null,null,null,null,null,null,"594"]
[null,null,null,null,null,null,null,null,null,null,null,null,null,null,null,null,null,null,"595"]
[null,null,null,null,null,null,null,null,null,null,null,null,null,null,null,null,null,null,"596"]
[null,null,null,null,null,null,null,null,null,null,null,null,null,null,null,null,null,null,"597"]
[null,null,null,null,null,null,null,null,null,null,null,null,null,null,null,null,null,null,"598"]
[null,null,null,null,null,null,null,null,null,null,null,null,null,null,null,null,null,null,"599"]
[null,null,null,null,null,null,null,null,null,null,null,null,null,null,null,null,null,null,"600"]
[null,null,null,null,null,null,null,null,null,null,null,null,null,null,null,null,null,null,"601"]
[null,null,null,null,null,null,null,null,null,null,null,null,null,null,null,null,null,null,"602"]
[null,null,null,null,null,null,null,null,null,null,null,null,null,null,null,null,null,null,"603"]
[null,null,null,null,null,null,null,null,null,null,null,null,null,null,null,null,null,null,"604"]
[null,null,null,null,null,null,null,null,null,null,null,null,null,null,null,null,null,null,"605"]
[null,null,null,null,null,null,null,null,null,null,null,null,null,null,null,null,null,null,"606"]
[null,null,null,null,null,null,null,null,null,null,null,null,null,null,null,null,null,null,"607"]
[null,null,null,null,null,null,null,null,null,null,null,null,null,null,null,null,null,null,"608"]
[null,null,null,null,null,null,null,null,null,null,null,null,null,null,null,null,null,null,"609"]
[null,null,null,null,null,null,null,null,null,null,null,null,null,null,null,null,null,null,"610"]
[null,null,null,null,null,null,null,null,null,null,null,null,null,null,null,null,null,null,"611"]
[null,null,null,null,null,null,null,null,null,null,null,null,null,null,null,null,null,null,"612"]
[null,null,null,null,null,null,null,null,null,null,null,null,null,null,null,null,null,null,"613"]
[null,null,null,null,null,null,null,null,null,null,null,null,null,null,null,null,null,null,"614"]
[null,null,null,null,null,null,null,null,null,null,null,null,null,null,null,null,null,null,"615"]
[null,null,null,null,null,null,null,null,null,null,null,null,null,null,null,null,null,null,"616"]
[null,null,null,null,null,null,null,null,null,null,null,null,null,null,null,null,null,null,"617"]
[null,null,null,null,null,null,null,null,null,null,null,null,null,null,null,null,null,null,"618"]
[null,null,null,null,null,null,null,null,null,null,null,null,null,null,null,null,null,null,"619"]
[null,null,null,null,null,null,null,null,null,null,null,null,null,null,null,null,null,null,"620"]
[null,null,null,null,null,null,null,null,null,null,null,null,null,null,null,null,null,null,"621"]
[null,null,null,null,null,null,null,null,null,null,null,null,null,null,null,null,null,null,"622"]
[null,null,null,null,null,null,null,null,null,null,null,null,null,null,null,null,null,null,"623"]
[null,null,null,null,null,null,null,null,null,null,null,null,null,null,null,null,null,null,"624"]
[null,null,null,null,null,null,null,null,null,null,null,null,null,null,null,null,null,null,"625"]
[null,null,null,null,null,null,null,null,null,null,null,null,null,null,null,null,null,null,"626"]
[null,null,null,null,null,null,null,null,null,null,null,null,null,null,null,null,null,null,"627"]
[null,null,null,null,null,null,null,null,null,null,null,null,null,null,null,null,null,null,"628"]
[null,null,null,null,null,null,null,null,null,null,null,null,null,null,null,null,null,null,"629"]
[null,null,null,null,null,null,null,null,null,null,null,null,null,null,null,null,null,null,"630"]
[null,null,null,null,null,null,null,null,null,null,null,null,null,null,null,null,null,null,"631"]
[null,null,null,null,null,null,null,null,null,null,null,null,null,null,null,null,null,null,"632"]
[null,null,null,null,null,null,null,null,null,null,null,null,null,null,null,null,null,null,"633"]
[null,null,null,null,null,null,null,null,null,null,null,null,null,null,null,null,null,null,"634"]
[null,null,null,null,null,null,null,null,null,null,null,null,null,null,null,null,null,null,"635"]
[null,null,null,null,null,null,null,null,null,null,null,null,null,null,null,null,null,null,"636"]
[null,null,null,null,null,null,null,null,null,null,null,null,null,null,null,null,null,null,"637"]
[null,null,null,null,null,null,null,null,null,null,null,null,null,null,null,null,null,null,"638"]
[null,null,null,null,null,null,null,null,null,null,null,null,null,null,null,null,null,null,"639"]
[null,null,null,null,null,null,null,null,null,null,null,null,null,null,null,null,null,null,"640"]
[null,null,null,null,null,null,null,null,null,null,null,null,null,null,null,null,null,null,"641"]
[null,null,null,null,null,null,null,null,null,null,null,null,null,null,null,null,null,null,"642"]
[null,null,null,null,null,null,null,null,null,null,null,null,null,null,null,null,null,null,"643"]
[null,null,null,null,null,null,null,null,null,null,null,null,null,null,null,null,null,null,"644"]
[null,null,null,null,null,null,null,null,null,null,null,null,null,null,null,null,null,null,"645"]
[null,null,null,null,null,null,null,null,null,null,null,null,null,null,null,null,null,null,"646"]
[null,null,null,null,null,null,null,null,null,null,null,null,null,null,null,null,null,null,"647"]
[null,null,null,null,null,null,null,null,null,null,null,null,null,null,null,null,null,null,"648"]
[null,null,null,null,null,null,null,null,null,null,null,null,null,null,null,null,null,null,"649"]
[null,null,null,null,null,null,null,null,null,null,null,null,null,null,null,null,null,null,"650"]
[null,null,null,null,null,null,null,null,null,null,null,null,null,null,null,null,null,null,"651"]
[null,null,null,null,null,null,null,null,null,null,null,null,null,null,null,null,null,null,"652"]
[null,null,null,null,null,null,null,null,null,null,null,null,null,null,null,null,null,null,"653"]
[null,null,null,null,null,null,null,null,null,null,null,null,null,null,null,null,null,null,"654"]
[null,null,null,null,null,null,null,null,null,null,null,null,null,null,null,null,null,null,"655"]
[null,null,null,null,null,null,null,null,null,null,null,null,null,null,null,null,null,null,"656"]
[null,null,null,null,null,null,null,null,null,null,null,null,null,null,null,null,null,null,"657"]
[null,null,null,null,null,null,null,null,null,null,null,null,null,null,null,null,null,null,"658"]
[null,null,null,null,null,null,null,null,null,null,null,null,null,null,null,null,null,null,"659"]
[null,null,null,null,null,null,null,null,null,null,null,null,null,null,null,null,null,null,"660"]
[null,null,null,null,null,null,null,null,null,null,null,null,null,null,null,null,null,null,"661"]
[null,null,null,null,null,null,null,null,null,null,null,null,null,null,null,null,null,null,"662"]
[null,null,null,null,null,null,null,null,null,null,null,null,null,null,null,null,null,null,"663"]
[null,null,null,null,null,null,null,null,null,null,null,null,null,null,null,null,null,null,"664"]
[null,null,null,null,null,null,null,null,null,null,null,null,null,null,null,null,null,null,"665"]
[null,null,null,null,null,null,null,null,null,null,null,null,null,null,null,null,null,null,"666"]
[null,null,null,null,null,null,null,null,null,null,null,null,null,null,null,null,null,null,"667"]
[null,null,null,null,null,null,null,null,null,null,null,null,null,null,null,null,null,null,"668"]
[null,null,null,null,null,null,null,null,null,null,null,null,null,null,null,null,null,null,"669"]
[null,null,null,null,null,null,null,null,null,null,null,null,null,null,null,null,null,null,"670"]
[null,null,null,null,null,null,null,null,null,null,null,null,null,null,null,null,null,null,"671"]
[null,null,null,null,null,null,null,null,null,null,null,null,null,null,null,null,null,null,"672"]
[null,null,null,null,null,null,null,null,null,null,null,null,null,null,null,null,null,null,"673"]
[null,null,null,null,null,null,null,null,null,null,null,null,null,null,null,null,null,null,"674"]
[null,null,null,null,null,null,null,null,null,null,null,null,null,null,null,null,null,null,"675"]
[null,null,null,null,null,null,null,null,null,null,null,null,null,null,null,null,null,null,"676"]
[null,null,null,null,null,null,null,null,null,null,null,null,null,null,null,null,null,null,"677"]
[null,null,null,null,null,null,null,null,null,null,null,null,null,null,null,null,null,null,"678"]
[null,null,null,null,null,null,null,null,null,null,null,null,null,null,null,null,null,null,"679"]
[null,null,null,null,null,null,null,null,null,null,null,null,null,null,null,null,null,null,"680"]
[null,null,null,null,null,null,null,null,null,null,null,null,null,null,null,null,null,null,"681"]
[null,null,null,null,null,null,null,null,null,null,null,null,null,null,null,null,null,null,"682"]
[null,null,null,null,null,null,null,null,null,null,null,null,null,null,null,null,null,null,"683"]
[null,null,null,null,null,null,null,null,null,null,null,null,null,null,null,null,null,null,"684"]
[null,null,null,null,null,null,null,null,null,null,null,null,null,null,null,null,null,null,"685"]
[null,null,null,null,null,null,null,null,null,null,null,null,null,null,null,null,null,null,"686"]
[null,null,null,null,null,null,null,null,null,null,null,null,null,null,null,null,null,null,"687"]
[null,null,null,null,null,null,null,null,null,null,null,null,null,null,null,null,null,null,"688"]
[null,null,null,null,null,null,null,null,null,null,null,null,null,null,null,null,null,null,"689"]
[null,null,null,null,null,null,null,null,null,null,null,null,null,null,null,null,null,null,"690"]
[null,null,null,null,null,null,null,null,null,null,null,null,null,null,null,null,null,null,"691"]
[null,null,null,null,null,null,null,null,null,null,null,null,null,null,null,null,null,null,"692"]
[null,null,null,null,null,null,null,null,null,null,null,null,null,null,null,null,null,null,"693"]
[null,null,null,null,null,null,null,null,null,null,null,null,null,null,null,null,null,null,"694"]
[null,null,null,null,null,null,null,null,null,null,null,null,null,null,null,null,null,null,"695"]
[null,null,null,null,null,null,null,null,null,null,null,null,null,null,null,null,null,null,"696"]
[null,null,null,null,null,null,null,null,null,null,null,null,null,null,null,null,null,null,"697"]
[null,null,null,null,null,null,null,null,null,null,null,null,null,null,null,null,null,null,"698"]
[null,null,null,null,null,null,null,null,null,null,null,null,null,null,null,null,null,null,"699"]
[null,null,null,null,null,null,null,null,null,null,null,null,null,null,null,null,null,null,"700"]
[null,null,null,null,null,null,null,null,null,null,null,null,null,null,null,null,null,null,"701"]
[null,null,null,null,null,null,null,null,null,null,null,null,null,null,null,null,null,null,"702"]
[null,null,null,null,null,null,null,null,null,null,null,null,null,null,null,null,null,null,"703"]
[null,null,null,null,null,null,null,null,null,null,null,null,null,null,null,null,null,null,"704"]
[null,null,null,null,null,null,null,null,null,null,null,null,null,null,null,null,null,null,"705"]
[null,null,null,null,null,null,null,null,null,null,null,null,null,null,null,null,null,null,"706"]
[null,null,null,null,null,null,null,null,null,null,null,null,null,null,null,null,null,null,"707"]
[null,null,null,null,null,null,null,null,null,null,null,null,null,null,null,null,null,null,"708"]
[null,null,null,null,null,null,null,null,null,null,null,null,null,null,null,null,null,null,"709"]
[null,null,null,null,null,null,null,null,null,null,null,null,null,null,null,null,null,null,"710"]
[null,null,null,null,null,null,null,null,null,null,null,null,null,null,null,null,null,null,"711"]
[null,null,null,null,null,null,null,null,null,null,null,null,null,null,null,null,null,null,"712"]
[null,null,null,null,null,null,null,null,null,null,null,null,null,null,null,null,null,null,"713"]
[null,null,null,null,null,null,null,null,null,null,null,null,null,null,null,null,null,null,"714"]
[null,null,null,null,null,null,null,null,null,null,null,null,null,null,null,null,null,null,"715"]
[null,null,null,null,null,null,null,null,null,null,null,null,null,null,null,null,null,null,"716"]
[null,null,null,null,null,null,null,null,null,null,null,null,null,null,null,null,null,null,"717"]
[null,null,null,null,null,null,null,null,null,null,null,null,null,null,null,null,null,null,"718"]
[null,null,null,null,null,null,null,null,null,null,null,null,null,null,null,null,null,null,"719"]
[null,null,null,null,null,null,null,null,null,null,null,null,null,null,null,null,null,null,"720"]
[null,null,null,null,null,null,null,null,null,null,null,null,null,null,null,null,null,null,"721"]
[null,null,null,null,null,null,null,null,null,null,null,null,null,null,null,null,null,null,"722"]
[null,null,null,null,null,null,null,null,null,null,null,null,null,null,null,null,null,null,"723"]
[null,null,null,null,null,null,null,null,null,null,null,null,null,null,null,null,null,null,"724"]
[null,null,null,null,null,null,null,null,null,null,null,null,null,null,null,null,null,null,"725"]
[null,null,null,null,null,null,null,null,null,null,null,null,null,null,null,null,null,null,"726"]
[null,null,null,null,null,null,null,null,null,null,null,null,null,null,null,null,null,null,"727"]
[null,null,null,null,null,null,null,null,null,null,null,null,null,null,null,null,null,null,"728"]
[null,null,null,null,null,null,null,null,null,null,null,null,null,null,null,null,null,null,"729"]
[null,null,null,null,null,null,null,null,null,null,null,null,null,null,null,null,null,null,"730"]
[null,null,null,null,null,null,null,null,null,null,null,null,null,null,null,null,null,null,"731"]
[null,null,null,null,null,null,null,null,null,null,null,null,null,null,null,null,null,null,"732"]
[null,null,null,null,null,null,null,null,null,null,null,null,null,null,null,null,null,null,"733"]
[null,null,null,null,null,null,null,null,null,null,null,null,null,null,null,null,null,null,"734"]
[null,null,null,null,null,null,null,null,null,null,null,null,null,null,null,null,null,null,"735"]
[null,null,null,null,null,null,null,null,null,null,null,null,null,null,null,null,null,null,"736"]
[null,null,null,null,null,null,null,null,null,null,null,null,null,null,null,null,null,null,"737"]
[null,null,null,null,null,null,null,null,null,null,null,null,null,null,null,null,null,null,"738"]
[null,null,null,null,null,null,null,null,null,null,null,null,null,null,null,null,null,null,"739"]
[null,null,null,null,null,null,null,null,null,null,null,null,null,null,null,null,null,null,"740"]
[null,null,null,null,null,null,null,null,null,null,null,null,null,null,null,null,null,null,"741"]
[null,null,null,null,null,null,null,null,null,null,null,null,null,null,null,null,null,null,"742"]
[null,null,null,null,null,null,null,null,null,null,null,null,null,null,null,null,null,null,"743"]
[null,null,null,null,null,null,null,null,null,null,null,null,null,null,null,null,null,null,"744"]
[null,null,null,null,null,null,null,null,null,null,null,null,null,null,null,null,null,null,"745"]
[null,null,null,null,null,null,null,null,null,null,null,null,null,null,null,null,null,null,"746"]
[null,null,null,null,null,null,null,null,null,null,null,null,null,null,null,null,null,null,"747"]
[null,null,null,null,null,null,null,null,null,null,null,null,null,null,null,null,null,null,"748"]
[null,null,null,null,null,null,null,null,null,null,null,null,null,null,null,null,null,null,"749"]
[null,null,null,null,null,null,null,null,null,null,null,null,null,null,null,null,null,null,"750"]
[null,null,null,null,null,null,null,null,null,null,null,null,null,null,null,null,null,null,"751"]
[null,null,null,null,null,null,null,null,null,null,null,null,null,null,null,null,null,null,"752"]
[null,null,null,null,null,null,null,null,null,null,null,null,null,null,null,null,null,null,"753"]
[null,null,null,null,null,null,null,null,null,null,null,null,null,null,null,null,null,null,"754"]
[null,null,null,null,null,null,null,null,null,null,null,null,null,null,null,null,null,null,"755"]
[null,null,null,null,null,null,null,null,null,null,null,null,null,null,null,null,null,null,"756"]
[null,null,null,null,null,null,null,null,null,null,null,null,null,null,null,null,null,null,"757"]
[null,null,null,null,null,null,null,null,null,null,null,null,null,null,null,null,null,null,"758"]
[null,null,null,null,null,null,null,null,null,null,null,null,null,null,null,null,null,null,"759"]
[null,null,null,null,null,null,null,null,null,null,null,null,null,null,null,null,null,null,"760"]
[null,null,null,null,null,null,null,null,null,null,null,null,null,null,null,null,null,null,"761"]
[null,null,null,null,null,null,null,null,null,null,null,null,null,null,null,null,null,null,"762"]
[null,null,null,null,null,null,null,null,null,null,null,null,null,null,null,null,null,null,"763"]
[null,null,null,null,null,null,null,null,null,null,null,null,null,null,null,null,null,null,"764"]
[null,null,null,null,null,null,null,null,null,null,null,null,null,null,null,null,null,null,"765"]
[null,null,null,null,null,null,null,null,null,null,null,null,null,null,null,null,null,null,"766"]
[null,null,null,null,null,null,null,null,null,null,null,null,null,null,null,null,null,null,"767"]
[null,null,null,null,null,null,null,null,null,null,null,null,null,null,null,null,null,null,"768"]
[null,null,null,null,null,null,null,null,null,null,null,null,null,null,null,null,null,null,"769"]
[null,null,null,null,null,null,null,null,null,null,null,null,null,null,null,null,null,null,"770"]
[null,null,null,null,null,null,null,null,null,null,null,null,null,null,null,null,null,null,"771"]
[null,null,null,null,null,null,null,null,null,null,null,null,null,null,null,null,null,null,"772"]
[null,null,null,null,null,null,null,null,null,null,null,null,null,null,null,null,null,null,"773"]
[null,null,null,null,null,null,null,null,null,null,null,null,null,null,null,null,null,null,"774"]
[null,null,null,null,null,null,null,null,null,null,null,null,null,null,null,null,null,null,"775"]
[null,null,null,null,null,null,null,null,null,null,null,null,null,null,null,null,null,null,"776"]
[null,null,null,null,null,null,null,null,null,null,null,null,null,null,null,null,null,null,"777"]
[null,null,null,null,null,null,null,null,null,null,null,null,null,null,null,null,null,null,"778"]
[null,null,null,null,null,null,null,null,null,null,null,null,null,null,null,null,null,null,"779"]
[null,null,null,null,null,null,null,null,null,null,null,null,null,null,null,null,null,null,"780"]
[null,null,null,null,null,null,null,null,null,null,null,null,null,null,null,null,null,null,"781"]
[null,null,null,null,null,null,null,null,null,null,null,null,null,null,null,null,null,null,"782"]
[null,null,null,null,null,null,null,null,null,null,null,null,null,null,null,null,null,null,"783"]
[null,null,null,null,null,null,null,null,null,null,null,null,null,null,null,null,null,null,"784"]
[null,null,null,null,null,null,null,null,null,null,null,null,null,null,null,null,null,null,"785"]
[null,null,null,null,null,null,null,null,null,null,null,null,null,null,null,null,null,null,"786"]
[null,null,null,null,null,null,null,null,null,null,null,null,null,null,null,null,null,null,"787"]
[null,null,null,null,null,null,null,null,null,null,null,null,null,null,null,null,null,null,"788"]
[null,null,null,null,null,null,null,null,null,null,null,null,null,null,null,null,null,null,"789"]
[null,null,null,null,null,null,null,null,null,null,null,null,null,null,null,null,null,null,"790"]
[null,null,null,null,null,null,null,null,null,null,null,null,null,null,null,null,null,null,"791"]
[null,null,null,null,null,null,null,null,null,null,null,null,null,null,null,null,null,null,"792"]
[null,null,null,null,null,null,null,null,null,null,null,null,null,null,null,null,null,null,"793"]
[null,null,null,null,null,null,null,null,null,null,null,null,null,null,null,null,null,null,"794"]
[null,null,null,null,null,null,null,null,null,null,null,null,null,null,null,null,null,null,"795"]
[null,null,null,null,null,null,null,null,null,null,null,null,null,null,null,null,null,null,"796"]
[null,null,null,null,null,null,null,null,null,null,null,null,null,null,null,null,null,null,"797"]
[null,null,null,null,null,null,null,null,null,null,null,null,null,null,null,null,null,null,"798"]
[null,null,null,null,null,null,null,null,null,null,null,null,null,null,null,null,null,null,"799"]
[null,null,null,null,null,null,null,null,null,null,null,null,null,null,null,null,null,null,"800"]
[null,null,null,null,null,null,null,null,null,null,null,null,null,null,null,null,null,null,"801"]
[null,null,null,null,null,null,null,null,null,null,null,null,null,null,null,null,null,null,"802"]
[null,null,null,null,null,null,null,null,null,null,null,null,null,null,null,null,null,null,"803"]
[null,null,null,null,null,null,null,null,null,null,null,null,null,null,null,null,null,null,"804"]
[null,null,null,null,null,null,null,null,null,null,null,null,null,null,null,null,null,null,"805"]
[null,null,null,null,null,null,null,null,null,null,null,null,null,null,null,null,null,null,"806"]
[null,null,null,null,null,null,null,null,null,null,null,null,null,null,null,null,null,null,"807"]
[null,null,null,null,null,null,null,null,null,null,null,null,null,null,null,null,null,null,"808"]
[null,null,null,null,null,null,null,null,null,null,null,null,null,null,null,null,null,null,"809"]
[null,null,null,null,null,null,null,null,null,null,null,null,null,null,null,null,null,null,"810"]
[null,null,null,null,null,null,null,null,null,null,null,null,null,null,null,null,null,null,"811"]
[null,null,null,null,null,null,null,null,null,null,null,null,null,null,null,null,null,null,"812"]
[null,null,null,null,null,null,null,null,null,null,null,null,null,null,null,null,null,null,"813"]
[null,null,null,null,null,null,null,null,null,null,null,null,null,null,null,null,null,null,"814"]
[null,null,null,null,null,null,null,null,null,null,null,null,null,null,null,null,null,null,"815"]
[null,null,null,null,null,null,null,null,null,null,null,null,null,null,null,null,null,null,"816"]
[null,null,null,null,null,null,null,null,null,null,null,null,null,null,null,null,null,null,"817"]
[null,null,null,null,null,null,null,null,null,null,null,null,null,null,null,null,null,null,"818"]
[null,null,null,null,null,null,null,null,null,null,null,null,null,null,null,null,null,null,"819"]
[null,null,null,null,null,null,null,null,null,null,null,null,null,null,null,null,null,null,"820"]
[null,null,null,null,null,null,null,null,null,null,null,null,null,null,null,null,null,null,"821"]
[null,null,null,null,null,null,null,null,null,null,null,null,null,null,null,null,null,null,"822"]
[null,null,null,null,null,null,null,null,null,null,null,null,null,null,null,null,null,null,"823"]
[null,null,null,null,null,null,null,null,null,null,null,null,null,null,null,null,null,null,"824"]
[null,null,null,null,null,null,null,null,null,null,null,null,null,null,null,null,null,null,"825"]
[null,null,null,null,null,null,null,null,null,null,null,null,null,null,null,null,null,null,"826"]
[null,null,null,null,null,null,null,null,null,null,null,null,null,null,null,null,null,null,"827"]
[null,null,null,null,null,null,null,null,null,null,null,null,null,null,null,null,null,null,"828"]
[null,null,null,null,null,null,null,null,null,null,null,null,null,null,null,null,null,null,"829"]
[null,null,null,null,null,null,null,null,null,null,null,null,null,null,null,null,null,null,"830"]
[null,null,null,null,null,null,null,null,null,null,null,null,null,null,null,null,null,null,"831"]
[null,null,null,null,null,null,null,null,null,null,null,null,null,null,null,null,null,null,"832"]
[null,null,null,null,null,null,null,null,null,null,null,null,null,null,null,null,null,null,"833"]
[null,null,null,null,null,null,null,null,null,null,null,null,null,null,null,null,null,null,"834"]
[null,null,null,null,null,null,null,null,null,null,null,null,null,null,null,null,null,null,"835"]
[null,null,null,null,null,null,null,null,null,null,null,null,null,null,null,null,null,null,"836"]
[null,null,null,null,null,null,null,null,null,null,null,null,null,null,null,null,null,null,"837"]
[null,null,null,null,null,null,null,null,null,null,null,null,null,null,null,null,null,null,"838"]
[null,null,null,null,null,null,null,null,null,null,null,null,null,null,null,null,null,null,"839"]
[null,null,null,null,null,null,null,null,null,null,null,null,null,null,null,null,null,null,"840"]
[null,null,null,null,null,null,null,null,null,null,null,null,null,null,null,null,null,null,"841"]
[null,null,null,null,null,null,null,null,null,null,null,null,null,null,null,null,null,null,"842"]
[null,null,null,null,null,null,null,null,null,null,null,null,null,null,null,null,null,null,"843"]
[null,null,null,null,null,null,null,null,null,null,null,null,null,null,null,null,null,null,"844"]
[null,null,null,null,null,null,null,null,null,null,null,null,null,null,null,null,null,null,"845"]
[null,null,null,null,null,null,null,null,null,null,null,null,null,null,null,null,null,null,"846"]
[null,null,null,null,null,null,null,null,null,null,null,null,null,null,null,null,null,null,"847"]
[null,null,null,null,null,null,null,null,null,null,null,null,null,null,null,null,null,null,"848"]
[null,null,null,null,null,null,null,null,null,null,null,null,null,null,null,null,null,null,"849"]
[null,null,null,null,null,null,null,null,null,null,null,null,null,null,null,null,null,null,"850"]
[null,null,null,null,null,null,null,null,null,null,null,null,null,null,null,null,null,null,"851"]
[null,null,null,null,null,null,null,null,null,null,null,null,null,null,null,null,null,null,"852"]
[null,null,null,null,null,null,null,null,null,null,null,null,null,null,null,null,null,null,"853"]
[null,null,null,null,null,null,null,null,null,null,null,null,null,null,null,null,null,null,"854"]
[null,null,null,null,null,null,null,null,null,null,null,null,null,null,null,null,null,null,"855"]
[null,null,null,null,null,null,null,null,null,null,null,null,null,null,null,null,null,null,"856"]
[null,null,null,null,null,null,null,null,null,null,null,null,null,null,null,null,null,null,"857"]
[null,null,null,null,null,null,null,null,null,null,null,null,null,null,null,null,null,null,"858"]
[null,null,null,null,null,null,null,null,null,null,null,null,null,null,null,null,null,null,"859"]
[null,null,null,null,null,null,null,null,null,null,null,null,null,null,null,null,null,null,"860"]
[null,null,null,null,null,null,null,null,null,null,null,null,null,null,null,null,null,null,"861"]
[null,null,null,null,null,null,null,null,null,null,null,null,null,null,null,null,null,null,"862"]
[null,null,null,null,null,null,null,null,null,null,null,null,null,null,null,null,null,null,"863"]
[null,null,null,null,null,null,null,null,null,null,null,null,null,null,null,null,null,null,"864"]
[null,null,null,null,null,null,null,null,null,null,null,null,null,null,null,null,null,null,"865"]
[null,null,null,null,null,null,null,null,null,null,null,null,null,null,null,null,null,null,"866"]
[null,null,null,null,null,null,null,null,null,null,null,null,null,null,null,null,null,null,"867"]
[null,null,null,null,null,null,null,null,null,null,null,null,null,null,null,null,null,null,"868"]
[null,null,null,null,null,null,null,null,null,null,null,null,null,null,null,null,null,null,"869"]
[null,null,null,null,null,null,null,null,null,null,null,null,null,null,null,null,null,null,"870"]
[null,null,null,null,null,null,null,null,null,null,null,null,null,null,null,null,null,null,"871"]
[null,null,null,null,null,null,null,null,null,null,null,null,null,null,null,null,null,null,"872"]
[null,null,null,null,null,null,null,null,null,null,null,null,null,null,null,null,null,null,"873"]
[null,null,null,null,null,null,null,null,null,null,null,null,null,null,null,null,null,null,"874"]
[null,null,null,null,null,null,null,null,null,null,null,null,null,null,null,null,null,null,"875"]
[null,null,null,null,null,null,null,null,null,null,null,null,null,null,null,null,null,null,"876"]
[null,null,null,null,null,null,null,null,null,null,null,null,null,null,null,null,null,null,"877"]
[null,null,null,null,null,null,null,null,null,null,null,null,null,null,null,null,null,null,"878"]
[null,null,null,null,null,null,null,null,null,null,null,null,null,null,null,null,null,null,"879"]
[null,null,null,null,null,null,null,null,null,null,null,null,null,null,null,null,null,null,"880"]
[null,null,null,null,null,null,null,null,null,null,null,null,null,null,null,null,null,null,"881"]
[null,null,null,null,null,null,null,null,null,null,null,null,null,null,null,null,null,null,"882"]
[null,null,null,null,null,null,null,null,null,null,null,null,null,null,null,null,null,null,"883"]
[null,null,null,null,null,null,null,null,null,null,null,null,null,null,null,null,null,null,"884"]
[null,null,null,null,null,null,null,null,null,null,null,null,null,null,null,null,null,null,"885"]
[null,null,null,null,null,null,null,null,null,null,null,null,null,null,null,null,null,null,"886"]
[null,null,null,null,null,null,null,null,null,null,null,null,null,null,null,null,null,null,"887"]
[null,null,null,null,null,null,null,null,null,null,null,null,null,null,null,null,null,null,"888"]
[null,null,null,null,null,null,null,null,null,null,null,null,null,null,null,null,null,null,"889"]
[null,null,null,null,null,null,null,null,null,null,null,null,null,null,null,null,null,null,"890"]
[null,null,null,null,null,null,null,null,null,null,null,null,null,null,null,null,null,null,"891"]
[null,null,null,null,null,null,null,null,null,null,null,null,null,null,null,null,null,null,"892"]
[null,null,null,null,null,null,null,null,null,null,null,null,null,null,null,null,null,null,"893"]
[null,null,null,null,null,null,null,null,null,null,null,null,null,null,null,null,null,null,"894"]
[null,null,null,null,null,null,null,null,null,null,null,null,null,null,null,null,null,null,"895"]
[null,null,null,null,null,null,null,null,null,null,null,null,null,null,null,null,null,null,"896"]
[null,null,null,null,null,null,null,null,null,null,null,null,null,null,null,null,null,null,"897"]
[null,null,null,null,null,null,null,null,null,null,null,null,null,null,null,null,null,null,"898"]
[null,null,null,null,null,null,null,null,null,null,null,null,null,null,null,null,null,null,"899"]
[null,null,null,null,null,null,null,null,null,null,null,null,null,null,null,null,null,null,"900"]
[null,null,null,null,null,null,null,null,null,null,null,null,null,null,null,null,null,null,"901"]
[null,null,null,null,null,null,null,null,null,null,null,null,null,null,null,null,null,null,"902"]
[null,null,null,null,null,null,null,null,null,null,null,null,null,null,null,null,null,null,"903"]
[null,null,null,null,null,null,null,null,null,null,null,null,null,null,null,null,null,null,"904"]
[null,null,null,null,null,null,null,null,null,null,null,null,null,null,null,null,null,null,"905"]
[null,null,null,null,null,null,null,null,null,null,null,null,null,null,null,null,null,null,"906"]
[null,null,null,null,null,null,null,null,null,null,null,null,null,null,null,null,null,null,"907"]
[null,null,null,null,null,null,null,null,null,null,null,null,null,null,null,null,null,null,"908"]
[null,null,null,null,null,null,null,null,null,null,null,null,null,null,null,null,null,null,"909"]
[null,null,null,null,null,null,null,null,null,null,null,null,null,null,null,null,null,null,"910"]
[null,null,null,null,null,null,null,null,null,null,null,null,null,null,null,null,null,null,"911"]
[null,null,null,null,null,null,null,null,null,null,null,null,null,null,null,null,null,null,"912"]
[null,null,null,null,null,null,null,null,null,null,null,null,null,null,null,null,null,null,"913"]
[null,null,null,null,null,null,null,null,null,null,null,null,null,null,null,null,null,null,"914"]
[null,null,null,null,null,null,null,null,null,null,null,null,null,null,null,null,null,null,"915"]
[null,null,null,null,null,null,null,null,null,null,null,null,null,null,null,null,null,null,"916"]
[null,null,null,null,null,null,null,null,null,null,null,null,null,null,null,null,null,null,"917"]
[null,null,null,null,null,null,null,null,null,null,null,null,null,null,null,null,null,null,"918"]
[null,null,null,null,null,null,null,null,null,null,null,null,null,null,null,null,null,null,"919"]
[null,null,null,null,null,null,null,null,null,null,null,null,null,null,null,null,null,null,"920"]
[null,null,null,null,null,null,null,null,null,null,null,null,null,null,null,null,null,null,"921"]
[null,null,null,null,null,null,null,null,null,null,null,null,null,null,null,null,null,null,"922"]
[null,null,null,null,null,null,null,null,null,null,null,null,null,null,null,null,null,null,"923"]
[null,null,null,null,null,null,null,null,null,null,null,null,null,null,null,null,null,null,"924"]
[null,null,null,null,null,null,null,null,null,null,null,null,null,null,null,null,null,null,"925"]
[null,null,null,null,null,null,null,null,null,null,null,null,null,null,null,null,null,null,"926"]
[null,null,null,null,null,null,null,null,null,null,null,null,null,null,null,null,null,null,"927"]
[null,null,null,null,null,null,null,null,null,null,null,null,null,null,null,null,null,null,"928"]
[null,null,null,null,null,null,null,null,null,null,null,null,null,null,null,null,null,null,"929"]
[null,null,null,null,null,null,null,null,null,null,null,null,null,null,null,null,null,null,"930"]
[null,null,null,null,null,null,null,null,null,null,null,null,null,null,null,null,null,null,"931"]
[null,null,null,null,null,null,null,null,null,null,null,null,null,null,null,null,null,null,"932"]
[null,null,null,null,null,null,null,null,null,null,null,null,null,null,null,null,null,null,"933"]
[null,null,null,null,null,null,null,null,null,null,null,null,null,null,null,null,null,null,"934"]
[null,null,null,null,null,null,null,null,null,null,null,null,null,null,null,null,null,null,"935"]
[null,null,null,null,null,null,null,null,null,null,null,null,null,null,null,null,null,null,"936"]
[null,null,null,null,null,null,null,null,null,null,null,null,null,null,null,null,null,null,"937"]
[null,null,null,null,null,null,null,null,null,null,null,null,null,null,null,null,null,null,"938"]
[null,null,null,null,null,null,null,null,null,null,null,null,null,null,null,null,null,null,"939"]
[null,null,null,null,null,null,null,null,null,null,null,null,null,null,null,null,null,null,"940"]
[null,null,null,null,null,null,null,null,null,null,null,null,null,null,null,null,null,null,"941"]
[null,null,null,null,null,null,null,null,null,null,null,null,null,null,null,null,null,null,"942"]
[null,null,null,null,null,null,null,null,null,null,null,null,null,null,null,null,null,null,"943"]
[null,null,null,null,null,null,null,null,null,null,null,null,null,null,null,null,null,null,"944"]
[null,null,null,null,null,null,null,null,null,null,null,null,null,null,null,null,null,null,"945"]
[null,null,null,null,null,null,null,null,null,null,null,null,null,null,null,null,null,null,"946"]
[null,null,null,null,null,null,null,null,null,null,null,null,null,null,null,null,null,null,"947"]
[null,null,null,null,null,null,null,null,null,null,null,null,null,null,null,null,null,null,"948"]
[null,null,null,null,null,null,null,null,null,null,null,null,null,null,null,null,null,null,"949"]
[null,null,null,null,null,null,null,null,null,null,null,null,null,null,null,null,null,null,"950"]
[null,null,null,null,null,null,null,null,null,null,null,null,null,null,null,null,null,null,"951"]
[null,null,null,null,null,null,null,null,null,null,null,null,null,null,null,null,null,null,"952"]
[null,null,null,null,null,null,null,null,null,null,null,null,null,null,null,null,null,null,"953"]
[null,null,null,null,null,null,null,null,null,null,null,null,null,null,null,null,null,null,"954"]
[null,null,null,null,null,null,null,null,null,null,null,null,null,null,null,null,null,null,"955"]
[null,null,null,null,null,null,null,null,null,null,null,null,null,null,null,null,null,null,"956"]
[null,null,null,null,null,null,null,null,null,null,null,null,null,null,null,null,null,null,"957"]
[null,null,null,null,null,null,null,null,null,null,null,null,null,null,null,null,null,null,"958"]
[null,null,null,null,null,null,null,null,null,null,null,null,null,null,null,null,null,null,"959"]
[null,null,null,null,null,null,null,null,null,null,null,null,null,null,null,null,null,null,"960"]
[null,null,null,null,null,null,null,null,null,null,null,null,null,null,null,null,null,null,"961"]
[null,null,null,null,null,null,null,null,null,null,null,null,null,null,null,null,null,null,"962"]
[null,null,null,null,null,null,null,null,null,null,null,null,null,null,null,null,null,null,"963"]
[null,null,null,null,null,null,null,null,null,null,null,null,null,null,null,null,null,null,"964"]
[null,null,null,null,null,null,null,null,null,null,null,null,null,null,null,null,null,null,"965"]
[null,null,null,null,null,null,null,null,null,null,null,null,null,null,null,null,null,null,"966"]
[null,null,null,null,null,null,null,null,null,null,null,null,null,null,null,null,null,null,"967"]
[null,null,null,null,null,null,null,null,null,null,null,null,null,null,null,null,null,null,"968"]
[null,null,null,null,null,null,null,null,null,null,null,null,null,null,null,null,null,null,"969"]
[null,null,null,null,null,null,null,null,null,null,null,null,null,null,null,null,null,null,"970"]
[null,null,null,null,null,null,null,null,null,null,null,null,null,null,null,null,null,null,"971"]
[null,null,null,null,null,null,null,null,null,null,null,null,null,null,null,null,null,null,"972"]
[null,null,null,null,null,null,null,null,null,null,null,null,null,null,null,null,null,null,"973"]
[null,null,null,null,null,null,null,null,null,null,null,null,null,null,null,null,null,null,"974"]
[null,null,null,null,null,null,null,null,null,null,null,null,null,null,null,null,null,null,"975"]
[null,null,null,null,null,null,null,null,null,null,null,null,null,null,null,null,null,null,"976"]
[null,null,null,null,null,null,null,null,null,null,null,null,null,null,null,null,null,null,"977"]
[null,null,null,null,null,null,null,null,null,null,null,null,null,null,null,null,null,null,"978"]
[null,null,null,null,null,null,null,null,null,null,null,null,null,null,null,null,null,null,"979"]
[null,null,null,null,null,null,null,null,null,null,null,null,null,null,null,null,null,null,"980"]
[null,null,null,null,null,null,null,null,null,null,null,null,null,null,null,null,null,null,"981"]
[null,null,null,null,null,null,null,null,null,null,null,null,null,null,null,null,null,null,"982"]
[null,null,null,null,null,null,null,null,null,null,null,null,null,null,null,null,null,null,"983"]
[null,null,null,null,null,null,null,null,null,null,null,null,null,null,null,null,null,null,"984"]
[null,null,null,null,null,null,null,null,null,null,null,null,null,null,null,null,null,null,"985"]
[null,null,null,null,null,null,null,null,null,null,null,null,null,null,null,null,null,null,"986"]
[null,null,null,null,null,null,null,null,null,null,null,null,null,null,null,null,null,null,"987"]
[null,null,null,null,null,null,null,null,null,null,null,null,null,null,null,null,null,null,"988"]
[null,null,null,null,null,null,null,null,null,null,null,null,null,null,null,null,null,null,"989"]
[null,null,null,null,null,null,null,null,null,null,null,null,null,null,null,null,null,null,"990"]
[null,null,null,null,null,null,null,null,null,null,null,null,null,null,null,null,null,null,"991"]
[null,null,null,null,null,null,null,null,null,null,null,null,null,null,null,null,null,null,"992"]
[null,null,null,null,null,null,null,null,null,null,null,null,null,null,null,null,null,null,"993"]
[null,null,null,null,null,null,null,null,null,null,null,null,null,null,null,null,null,null,"994"]
[null,null,null,null,null,null,null,null,null,null,null,null,null,null,null,null,null,null,"995"]
[null,null,null,null,null,null,null,null,null,null,null,null,null,null,null,null,null,null,"996"]
[null,null,null,null,null,null,null,null,null,null,null,null,null,null,null,null,null,null,"997"]
[null,null,null,null,null,null,null,null,null,null,null,null,null,null,null,null,null,null,"998"]
[null,null,null,null,null,null,null,null,null,null,null,null,null,null,null,null,null,null,"999"]

{"sheet":"Mix Info","index":2,"n_rows":27,"n_cols":23,"rows_kept":27,"cut":false,"hidden":false,"merged":[[5,9,5,10],[4,9,4,10]]}
["Mix Number: ","1","2","3","4",5,null,"Enter Agg. Percentages for",null,null,"Enter Target Gradation",null,null," Mix Parameters for",null,null,null,"Yes",null,null,null,null,"2000-10-15"]
["Mix Type:  ",null,null,null,null,null,null,"BR, QMC, QMPEM, HPC-D, SCC",null,null,"for QMC, QMPEM, or C-SUD  Mixes",null,null,"QMPEM","I","CDM",null,null,null,null,null,null,"2000-03-16"]
["Date:  ",null,null,null,null,null,"CDM, C-SUD(CW) Mixes(ENTER)",null,null,null,"When (ENTER) displays",null,null," (Contractor Design)","I/II","SCC"]
["Cement Type:  ",null,null,null,null,null,null,{"$f":"IF(OR(B2=\"BR\",B2=\"QMC\",B2=\"HPC-D\",B2=\"SCC\",B2=\"CDM\",B2=\"C-SUD\",B2=\"QMPEM\",B2=\"C-SUDCW\"),\"ENTER\",IF(OR(C2=\"BR\",C2=\"QMC\",C2=\"HPC-D\",C2=\"SCC\",C2=\"CDM\",C2=\"C-SUD\",C2=\"QMPEM\",C2=\"C-SUDCW\"),\"ENTER\",IF(OR(D2=\"BR\",D2=\"QMC\",D2=\"HPC-D\",D2=\"SCC\",D2=\"CDM\",D2=\"C-SUD\",D2=\"QMPEM\",D2=\"C-SUDCW\"),\"ENTER\",IF(OR(E2=\"BR\",E2=\"QMC\",E2=\"HPC-D\",E2=\"SCC\",E2=\"CDM\",E2=\"C-SUD\",E2=\"QMPEM\",E2=\"C-SUDCW\"),\"ENTER\",IF(OR(F2=\"BR\",F2=\"QMC\",F2=\"HPC-D\",F2=\"SCC\",F2=\"CDM\",F2=\"C-SUD\",F2=\"QMPEM\",F2=\"C-SUDCW\"),\"ENTER\",\"\")))))","v":""},null," ",{"$f":"IF(OR(B2=\"QMC\",B2=\"C-SUD\", B2=\"QMPEM\",B2=\"C-SUDCW\"),\"ENTER\",IF(OR(C2=\"QMC\",C2=\"C-SUD\", C2=\"QMPEM\",C2=\"C-SUDCW\"),\"ENTER\",IF(OR(D2=\"QMC\",D2=\"C-SUD\", D2=\"QMPEM\",D2=\"C-SUDCW\"),\"ENTER\",IF(OR(E2=\"QMC\",E2=\"C-SUD\", E2=\"QMPEM\",E2=\"C-SUDCW\"),\"ENTER\",IF(OR(F2=\"QMC\",F2=\"C-SUD\", F2=\"QMPEM\",F2=\"C-SUDCW\"),\"ENTER\",\"\")))))","v":""},null,null," CDM, SCC, QMPEM Mixes","III","QMPEM",null,null,null,null,null,null,{"$f":"DATE(YEAR(TODAY()),MONTH(W1), DAY(W1))","v":"2025-10-15"}]
["Cement Specific Gravity:  ",null,null,null,null,null,"% Coarse",null,null,null,null,null,"Abs. Vol. :",0.1086,"IL",null,null,null,null,null,null,null,{"$f":"DATE(YEAR(TODAY()),MONTH(W2), DAY(W2))","v":"2025-03-16"}]
["% Fly Ash:  ",null,null,null,null,null,"%Intermediate",null,null,"Target Gradation",null,null,"Basic w/c :",0.4,"IP(25)"]
["Fly Ash Type:  ",null,null,null,null,null,"% Fine",null,null,null,null,null,"Max. w/c :",0.42,"IP(30)"]
["Fly Ash Specific Gravity:  ",null,null,null,null,null,"Total (100%)",{"$f":"IF(H4=\"\",0,(H5+H6+H7))","v":0},null,"1 1/2\" (37.5 mm)",null,null,null,null,"IT(S20)(L9)",null,null,{"$f":"IF(AND(B6>20, OR(B2=\"HPC-O\", B2=\"HPC-S\", B2=\"HPC-D\", B2=\"CV-HPC-S\", B2=\"CV-HPC-D\")), \"Yes\",\"\")","v":""},{"$f":"IF(AND(C6>20, OR(C2=\"HPC-O\", C2=\"HPC-S\", C2=\"HPC-D\", C2=\"CV-HPC-S\", C2=\"CV-HPC-D\")), \"Yes\",\"\")","v":""},"","",""]
["% GGBFS:  ",null,null,null,null,null,{"$f":"IF(AND(H4=\"ENTER\",H8<100),\"Enter Aggregate Percentages\",\"\")","v":""},null,null,"1\" (25 mm)",null,null,null,null,"IT(S38)(L7)",null,null,{"$f":"IF(AND(OR(B4=\"I/II\", B4=\"IL(10)\",B4=\"IL(11)\", B4=\"IL(12)\"), B2=\"HPC-O\", OR( B9<25, B9>35)), \"Yes\",\"\")","v":""},{"$f":"IF(AND(OR(C4=\"I/II\", C4=\"IL(10)\",C4=\"IL(11)\", C4=\"IL(12)\"), C2=\"HPC-O\", OR( C9<25, C9>35)), \"Yes\",\"\")","v":""},{"$f":"IF(AND(OR(D4=\"I/II\", D4=\"IL(10)\",D4=\"IL(11)\", D4=\"IL(12)\"), D2=\"HPC-O\", OR( D9<25, D9>35)), \"Yes\",\"\")","v":""},{"$f":"IF(AND(OR(E4=\"I/II\", E4=\"IL(10)\",E4=\"IL(11)\", E4=\"IL(12)\"), E2=\"HPC-O\", OR( E9<25, E9>35)), \"Yes\",\"\")","v":""},{"$f":"IF(AND(OR(F4=\"I/II\", F4=\"IL(10)\",F4=\"IL(11)\", F4=\"IL(12)\"), F2=\"HPC-O\", OR( F9<25, F9>35)), \"Yes\",\"\")","v":""}]
["GGBFS Specific Gravity:  ",null,null,null,null,null,{"$f":"IF('Report '!Y35=\"IP, IS, IT\",\"\", IF(OR(B2=\"HPC-O\", B2=\"HPC-D\", B2=\"HPC-S\", C2=\"HPC-O\", C2=\"HPC-D\", C2=\"HPC-S\", D2=\"HPC-O\", D2=\"HPC-D\", D2=\"HPC-S\", E2=\"HPC-O\", E2=\"HPC-D\", E2=\"HPC-S\", F2=\"HPC-O\", F2=\"HPC-D\", F2=\"HPC-S\"), \"Slag Required\",\"\"))","v":""},null,null,"3/4\" (19 mm)",null,null,null,null,"IT(P25)(L6)",null,null,{"$f":"IF(AND(OR(B4=\"IP(25)\", B4=\"IP(30)\", B4=\"IS(20)\", B4=\"IS(25)\", B4=\"IS(38)\", B4=\"IT(S20)(L10)\", B4=\"IT(S20)(L12)\", B4=\"IT(S20)(P5)\"), B2=\"HPC-O\", B9>0), \"Yes\",\"\")","v":""},{"$f":"IF(AND(OR(C4=\"IP(25)\", C4=\"IP(30)\", C4=\"IS(20)\", C4=\"IS(25)\", C4=\"IS(38)\", C4=\"IT(S20)(L10)\", C4=\"IT(S20)(L12)\", C4=\"IT(S20)(P5)\"), C2=\"HPC-O\", C9>0), \"Yes\",\"\")","v":""},"","",""]
["T-203 Fine Agg. Specific Gravity:  ",null,null,null,null,null,{"$f":"IF(OR('Report '!Y40=\"3iB\", 'Report '!Y41=\"3iB\"), \"\", IF(OR(B2=\"HPC-O\",  C2=\"HPC-O\", D2=\"HPC-O\",  E2=\"HPC-O\",  F2=\"HPC-O\", B2=\"O-4WR\", C2=\"O-4WR\", D2=\"O-4WR\",  E2=\"O-4WR\", F2=\"O-4WR\"), \"3iB STONE REQUIRED\",\"\"))","v":""},null,null,"1/2\" (12.5 mm)",null,null,null,null,null,null,null,{"$f":"IF(AND(OR(B4=\"I/II\", B4=\"IL(10)\",B4=\"IL(11)\", B4=\"IL(12)\"), OR(B2=\"HPC-D\", B2=\"HPC-S\", B2=\"CV-HPC-D\", B2=\"CV-HPC-S\"), OR(B9>35, B9<30)), \"Yes\",\"\")","v":""},{"$f":"IF(AND(OR(C4=\"I/II\", C4=\"IL(10)\",C4=\"IL(11)\", C4=\"IL(12)\"), OR(C2=\"HPC-D\", C2=\"HPC-S\", C2=\"CV-HPC-D\", C2=\"CV-HPC-S\"), OR(C9>35, C9<30)), \"Yes\",\"\")","v":""},"","",""]
["Intermediate Agg. Specific Gravity:",null,null,null,null,null,{"$f":"IF(B2=\"\",\"\", IF(R21<>\"\", \"Please Check Your Replacement %.\", \"\"))","v":""},null,null,"3/8\" (9.5 mm)",null,null,null,null,null,null,null,{"$f":"IF(AND(OR(B4=\"IP(25)\", B4=\"IP(30)\", B4=\"IS(20)\", B4=\"IS(25)\", B4=\"IS(38)\", B4=\"IT(S20)(L10)\", B4=\"IT(S20)(L12)\", B4=\"IT(S20)(P5)\"), OR(B2=\"HPC-S\", B2=\"HPC-D\", B2=\"CV-HPC-S\", B2=\"CV-HPC-D\"), B9>0), \"Yes\",\"\")","v":""},{"$f":"IF(AND(OR(C4=\"IP(25)\", C4=\"IP(30)\", C4=\"IS(20)\", C4=\"IS(25)\", C4=\"IS(38)\", C4=\"IT(S20)(L10)\", C4=\"IT(S20)(L12)\", C4=\"IT(S20)(P5)\"), OR(C2=\"HPC-S\", C2=\"HPC-D\", C2=\"CV-HPC-S\", C2=\"CV-HPC-D\"), C9>0), \"Yes\",\"\")","v":""},"","",""]
["T-203 Coarse Agg. Specific Gravity:  ",null,null,null,null,null,{"$f":"IF(B2=\"\",\"\", IF(R22<>\"\", \"Over Your Max Allowed Replacement.\", \"\"))","v":""},null,null,"#4 (4.75mm)",null,null,null,null,null,"X",null,{"$f":"IF(AND(B2=\"BR\", OR(B3>$W$4, B3<$W$5), B6>0, OR(B4=\"IP(25)\", B4=\"IP(30)\", B4=\"IS(20)\", B4=\"IS(25)\", B4=\"IS(38)\", B4=\"IT(S20)(L10)\", B4=\"IT(S20)(P5)\", B4=\"IT(S20)(L12)\", B4=\"IT(S38)(L7)\")), \"YES\", \"\")","v":""},{"$f":"IF(AND(C2=\"BR\", OR(C3>$W$4, C3<$W$5), C6>0, OR(C4=\"IP(25)\", C4=\"IP(30)\", C4=\"IS(20)\", C4=\"IS(25)\", C4=\"IS(38)\", C4=\"IT(S20)(L10)\", C4=\"IT(S20)(P5)\", C4=\"IT(S20)(L12)\", C4=\"IT(S38)(L7)\")), \"YES\", \"\")","v":""},"","",""]
["Fine Agg. % Moisture:  ",null,null,null,null,null,null,null,null,"#8 (2.36 mm)",null,null,null,null,null,null,null,{"$f":"IF(AND(B2=\"BR\", AND(B3<=$W$4, B3>=$W$5), B6>20, OR(B4=\"IP(25)\", B4=\"IP(30)\", B4=\"IS(20)\", B4=\"IS(25)\", B4=\"IS(38)\", B4=\"IT(S20)(L10)\", B4=\"IT(S20)(P5)\", B4=\"IT(S20)(L12)\", B4=\"IT(S38)(L7)\")), \"YES\", \"\")","v":""},{"$f":"IF(AND(C2=\"BR\", AND(C3<=$W$4, C3>=$W$5), C6>20, OR(C4=\"IP(25)\", C4=\"IP(30)\", C4=\"IS(20)\", C4=\"IS(25)\", C4=\"IS(38)\", C4=\"IT(S20)(L10)\", C4=\"IT(S20)(P5)\", C4=\"IT(S20)(L12)\", C4=\"IT(S38)(L7)\")), \"YES\", \"\")","v":""},"","",""]
["Intermediate Agg. % Moisture:  ",null,null,null,null,null,null,null,null,"#16 (1.18 mm)",null,null,null,null,null,"C",null,{"$f":"IF(AND(B2=\"BR\", OR(B3>$W$4, B3<$W$5), B6>20, OR(B4=\"I\", B4=\"I/II\", B4=\"III\", B4=\"IL(10)\", B4=\"IL(11)\", B4=\"IL(12)\")), \"YES\", \"\")","v":""},{"$f":"IF(AND(C2=\"BR\", OR(C3>$W$4, C3<$W$5), C6>20, OR(C4=\"I\", C4=\"I/II\", C4=\"III\", C4=\"IL(10)\", C4=\"IL(11)\", C4=\"IL(12)\")), \"YES\", \"\")","v":""},"","",""]
["Coarse Agg. % Moisture:  ",null,null,null,null,null,null,null,null,"#30 (600µm)",null,null,null,null,null,"F",null,{"$f":"IF(AND(B2=\"BR\", AND(B3<=$W$4, B3>=$W$5), B6>20, OR(B4=\"I\", B4=\"I/II\", B4=\"III\", B4=\"IL(10)\", B4=\"IL(11)\", B4=\"IL(12)\")), \"YES\", \"\")","v":""},{"$f":"IF(AND(C2=\"BR\", AND(C3<=$W$4, C3>=$W$5), C6>20, OR(C4=\"I\", C4=\"I/II\", C4=\"III\", C4=\"IL(10)\", C4=\"IL(11)\", C4=\"IL(12)\")), \"YES\", \"\")","v":""},"","",""]
["Starting Time ( Paving ):  ",null,null,null,null,null,null,null,null,"#50 (300µm)",null,null,null,null,null,"CF",null,{"$f":"IF(AND(B2=\"BR\", OR(B3>$W$4, B3<$W$5), B9>0, OR(B4=\"IP(25)\", B4=\"IP(30)\", B4=\"IS(20)\", B4=\"IS(25)\", B4=\"IS(38)\", B4=\"IT(S20)(L10)\", B4=\"IT(S20)(P5)\", B4=\"IT(S20)(L12)\", B4=\"IT(S38)(L7)\")), \"YES\", \"\")","v":""},{"$f":"IF(AND(C2=\"BR\", OR(C3>$W$4, C3<$W$5), C9>0, OR(C4=\"IP(25)\", C4=\"IP(30)\", C4=\"IS(20)\", C4=\"IS(25)\", C4=\"IS(38)\", C4=\"IT(S20)(L10)\", C4=\"IT(S20)(P5)\", C4=\"IT(S20)(L12)\", C4=\"IT(S38)(L7)\")), \"YES\", \"\")","v":""},"","",""]
["Stop Time ( Paving ):  ",null,null,null,null,null,null,null,null,"#100 (150µm)",null,null,null,null,null,null,null,{"$f":"IF(AND(B2=\"BR\", AND(B3<=$W$4, B3>=$W$5), B9>0, OR(B4=\"IP(25)\", B4=\"IP(30)\", B4=\"IS(20)\", B4=\"IS(25)\", B4=\"IS(38)\", B4=\"IT(S20)(L10)\", B4=\"IT(S20)(P5)\", B4=\"IT(S20)(L12)\", B4=\"IT(S38)(L7)\")), \"YES\", \"\")","v":""},{"$f":"IF(AND(C2=\"BR\", AND(C3<=$W$4, C3>=$W$5), C9>0, OR(C4=\"IP(25)\", C4=\"IP(30)\", C4=\"IS(20)\", C4=\"IS(25)\", C4=\"IS(38)\", C4=\"IT(S20)(L10)\", C4=\"IT(S20)(P5)\", C4=\"IT(S20)(L12)\", C4=\"IT(S38)(L7)\")), \"YES\", \"\")","v":""},"","",""]
["Cubic yds Batched:  ",null,null,null,null,null,"Enter English units",null,null,"#200 (75µm) Max",{"$f":"IF('Proj Info'!E44=\"No\",2,1.5)","v":2},null,null,null,null,null,null,{"$f":"IF(AND(B2=\"BR\", OR(B3>$W$4, B3<$W$5), B9>0, OR(B4=\"I\", B4=\"I/II\", B4=\"III\", B4=\"IL(10)\", B4=\"IL(11)\", B4=\"IL(12)\")), \"YES\", \"\")","v":""},{"$f":"IF(AND(C2=\"BR\", OR(C3>$W$4, C3<$W$5), C9>0, OR(C4=\"I\", C4=\"I/II\", C4=\"III\", C4=\"IL(10)\", C4=\"IL(11)\", C4=\"IL(12)\")), \"YES\", \"\")","v":""},"","",""]
["% Of Estimated Used:",null,null,null,null,null,null,null,null,null,null,null,null,null,0,null,null,{"$f":"IF(AND(B2=\"BR\", AND(B3<=$W$4, B3>=$W$5), B9>35, OR(B4=\"I\", B4=\"I/II\", B4=\"III\", B4=\"IL(10)\", B4=\"IL(11)\", B4=\"IL(12)\")), \"YES\", \"\")","v":""},{"$f":"IF(AND(C2=\"BR\", AND(C3<=$W$4, C3>=$W$5), C9>35, OR(C4=\"I\", C4=\"I/II\", C4=\"III\", C4=\"IL(10)\", C4=\"IL(11)\", C4=\"IL(12)\")), \"YES\", \"\")","v":""},"","",""]
["Waste:",null,null,null,null,null,null,"District Assigned QMC Mix # ===>",null,null,null,null,null,null,1,null,null,{"$f":"IF(COUNTIF(R8:V20,R1),\"YES\", \"\")","v":""}]
["Plant Water Added Lbs/CY :  ",null,null,null,null,null,"Enter English units",null,null,null,null,null,null,null,2,null,null,{"$f":"IF(COUNTIF('E820150'!J14:N15,R1),\"YES\", \"\")","v":""}]
["Grade Water Added Lbs/CY :  ",null,null,null,null,null,"Enter English units",null,null,null,null,null,null,null,3]
[null,{"$f":"IF(B2=\"\",\"\",IF(AND(B6=\"\",B9=\"\"),B2,IF(B9=\"\",CONCATENATE(B2,\"-\",B7,B6),CONCATENATE(B2,\"-\",B7,B6,\"S\",B9))))","v":""},{"$f":"IF(C2=\"\",\"\",IF(AND(C6=\"\",C9=\"\"),C2,IF(C9=\"\",CONCATENATE(C2,\"-\",C7,C6),CONCATENATE(C2,\"-\",C7,C6,\"S\",C9))))","v":""},{"$f":"IF(D2=\"\",\"\",IF(AND(D6=\"\",D9=\"\"),D2,IF(D9=\"\",CONCATENATE(D2,\"-\",D7,D6),CONCATENATE(D2,\"-\",D7,D6,\"S\",D9))))","v":""},{"$f":"IF(E2=\"\",\"\",IF(AND(E6=\"\",E9=\"\"),E2,IF(E9=\"\",CONCATENATE(E2,\"-\",E7,E6),CONCATENATE(E2,\"-\",E7,E6,\"S\",E9))))","v":""},{"$f":"IF(F2=\"\",\"\",IF(AND(F6=\"\",F9=\"\"),F2,IF(F9=\"\",CONCATENATE(F2,\"-\",F7,F6),CONCATENATE(F2,\"-\",F7,F6,\"S\",F9))))","v":""}]
["w/c, enter if lower than basic w/c"]
["DS for >4500 psi Adjust W/C for Mix ENTER X"]
[{"$f":"IF(AND('Proj Info'!B71=\"\",'Proj Info'!C71=\"\"),\"CO2 Admix (%): \",IF('Proj Info'!B71<>\"\",_xlfn.CONCAT('Proj Info'!B71,\"(%): \"),_xlfn.CONCAT('Proj Info'!C71,\"(%): \")))","v":"CO2 Admix (%): "},0,0,0,0,0]

{"sheet":"E820150","index":3,"n_rows":70,"n_cols":14,"rows_kept":70,"cut":false,"hidden":false,"merged":[[21,3,21,4],[22,3,22,4],[0,1,0,5],[1,1,1,5],[2,1,2,5],[20,3,20,4]]}
[{"$f":"Menu!C1","v":"2025-01-01"},"Iowa Department Of Transportation",null,null,null,null,null,"Form  E820150",null,"(kgs/cm) / ( Sp. Gr. X 1000)            =            ","(lbs/cy) / ( Sp. Gr. X 62.4 X 27)           ="]
["C. Barko","Office Of Materials",null,null,null,null,null,{"$f":"IF('Proj Info'!$B$1=\"M\",\"'M - Units\",\"E - Units\")","v":"E - Units"},null,"kgs","lbs"]
[null,"PORTLAND CEMENT CONCRETE",null,null,null,null,null,null,null,"kgs/cm","lbs/cy"]
[null,null,null,null,null,null,null,null,null,"Abs Vol. X Sp. Gr. X 1000","Abs Vol. X Sp. Gr. X 62.4 X 27"]
["Project No.: ",{"$f":"IF('Proj Info'!B8=\"\",\"\",'Proj Info'!B8)","v":""},null,null,null,"County : ",{"$f":"IF('Proj Info'!B14=\"\",\"\",'Proj Info'!B14)","v":""}]
[]
["Mix No.: ",{"$f":"IF('Mix Info'!B24=\"\",\"\", IF('Mix Info'!B2=\"FM-Non Cr. Fl.\", \"FM-Non Critical Fluidity\",IF('Mix Info'!B2=\"FM-Cr. Fl.\", \"FM-Critical Fluidity\",'Mix Info'!B24)))","v":""},null,"Abs Vol. Cement:",{"$f":"IF(E820150A!B13=\"\",\"\", IF(AND('Mix Info'!H4=\"ENTER\", 'Mix Info'!K4=\"ENTER\", 'Mix Info'!N2=\"QMCDM\", OR('Mix Info'!B2=\"QMCDM\",'Mix Info'!C2=\"QMCDM\",'Mix Info'!D2=\"QMCDM\",'Mix Info'!E2=\"QMCDM\",'Mix Info'!F2=\"QMCDM\")), 'Mix Info'!N5,E820150A!B13))","v":""},null,"Type:  ",{"$f":"IF(AND('Proj Info'!B34=\"\",'Proj Info'!C34=\"\"),\"\",IF('Proj Info'!B34<>\"\", 'Proj Info'!B34, 'Proj Info'!C34))","v":""}]
[]
["Cement (IM 401): ",{"$f":"IF(B7=\"FM-Non Critical Fluidity\", \"100\", IF(B7=\"FM-Critical Fluidity\", \"100\",IF(E820150A!B33=\"\",\"\", E820150A!B33)))","v":""},{"$f":"IF('Proj Info'!$B$1=\"M\",$J$2,$K$2)","v":"lbs"},"Source: ",{"$f":"IF(AND('Proj Info'!B33=\"\",'Proj Info'!C33=\"\"),\"\",IF('Proj Info'!B33<>\"\", 'Proj Info'!B33, 'Proj Info'!C33))","v":""},null,"Sp. Gr.: ",{"$f":"IF(AND('Proj Info'!B35=\"\",'Proj Info'!C35=\"\"),\"\",IF('Proj Info'!B35<>\"\", 'Proj Info'!B35, 'Proj Info'!C35))","v":""}]
[null,"%"]
["Fly Ash (IM 491.17):",{"$f":"IF('Mix Info'!B6=\"\",\"\",'Mix Info'!B6)","v":""},{"$f":"IF(B7=\"FM-Non Critical Fluidity\",\"300\", IF(B7=\"FM-Critical Fluidity\",\"400\",IF(E820150A!B35=\"\",\"\",IF(B7=\"\",\"\",E820150A!B35))))","v":""},"Source: ",{"$f":"IF(AND('Proj Info'!B36=\"\",'Proj Info'!C36=\"\"),\"\",IF('Proj Info'!B36<>\"\", 'Proj Info'!B36, 'Proj Info'!C36))","v":""},null,"Sp. Gr.: ",{"$f":"IF(AND('Proj Info'!B38=\"\",'Proj Info'!C38=\"\"),\"\",IF('Proj Info'!B38<>\"\", 'Proj Info'!B38, 'Proj Info'!C38))","v":""}]
[null,"%"]
["Slag (IM 491.14): ",{"$f":"IF('Mix Info'!B9=\"\",\"\",'Mix Info'!B9)","v":""},{"$f":"IF(E820150A!B36=\"\",\"\",IF(B7=\"\",\"\",E820150A!B36))","v":""},"Source: ",{"$f":"IF(AND('Proj Info'!B39=\"\",'Proj Info'!C39=\"\"),\"\",IF('Proj Info'!B39<>\"\", 'Proj Info'!B39, 'Proj Info'!C39))","v":""},null,"Sp. Gr.: ",{"$f":"IF(AND('Proj Info'!B41=\"\",'Proj Info'!C41=\"\"),\"\",IF('Proj Info'!B41<>\"\", 'Proj Info'!B41, 'Proj Info'!C41))","v":""}]
[null,"%",null,null,null,null,null,null,null,{"$f":"IF('Mix Info'!B2=\"\",\"\", IF(AND(G19>50, OR('Mix Info'!B2=\"HPC-S\", 'Mix Info'!B2=\"HPC-D\", 'Mix Info'!B2=\"CV-HPC-S\", 'Mix Info'!B2=\"CV-HPC-D\", 'Mix Info'!B2=\"BR\")), \"Yes\",\"\"))","v":""},{"$f":"IF('Mix Info'!C2=\"\",\"\", IF(AND(('Mix Info'!C6+'Mix Info'!C9)>50, OR('Mix Info'!C2=\"HPC-S\", 'Mix Info'!C2=\"HPC-D\", 'Mix Info'!C2=\"CV-HPC-S\", 'Mix Info'!C2=\"CV-HPC-D\", 'Mix Info'!C2=\"BR\")), \"Yes\",\"\"))","v":""},{"$f":"IF('Mix Info'!D2=\"\",\"\", IF(AND(('Mix Info'!D6+'Mix Info'!D9)>50, OR('Mix Info'!D2=\"HPC-S\", 'Mix Info'!D2=\"HPC-D\", 'Mix Info'!D2=\"CV-HPC-S\", 'Mix Info'!D2=\"CV-HPC-D\", 'Mix Info'!D2=\"BR\")), \"Yes\",\"\"))","v":""},{"$f":"IF('Mix Info'!E2=\"\",\"\", IF(AND(('Mix Info'!E6+'Mix Info'!E9)>50, OR('Mix Info'!E2=\"HPC-S\", 'Mix Info'!E2=\"HPC-D\", 'Mix Info'!E2=\"CV-HPC-S\", 'Mix Info'!E2=\"CV-HPC-D\", 'Mix Info'!E2=\"BR\")), \"Yes\",\"\"))","v":""},{"$f":"IF('Mix Info'!F2=\"\",\"\", IF(AND(('Mix Info'!F6+'Mix Info'!F9)>50, OR('Mix Info'!F2=\"HPC-S\", 'Mix Info'!F2=\"HPC-D\", 'Mix Info'!F2=\"CV-HPC-S\", 'Mix Info'!F2=\"CV-HPC-D\", 'Mix Info'!F2=\"BR\")), \"Yes\",\"\"))","v":""}]
[{"$f":"IF(AND('Proj Info'!B71=\"\",'Proj Info'!C71=\"\"),\"CO2 Admix: \",IF('Proj Info'!B71<>\"\",_xlfn.CONCAT('Proj Info'!B71,\":\"),_xlfn.CONCAT('Proj Info'!C71,\":\")))","v":"CO2 Admix: "},{"$f":"IF('Mix Info'!B2=\"\",\"\",'Mix Info'!B27)","v":""},{"$f":"IF(B15=\"\",0,E820150A!B33-E820150A!B34-E820150A!B35-E820150A!B36)","v":0}," Cement Reduction",null,null,null,null,null,{"$f":"IF('Mix Info'!B2=\"\",\"\", IF(AND(G19>50, 'Mix Info'!B2=\"HPC-O\"), \"Yes\",\"\"))","v":""},{"$f":"IF('Mix Info'!C2=\"\",\"\", IF(AND(('Mix Info'!C6+'Mix Info'!C9)>45, 'Mix Info'!C2=\"HPC-O\"), \"Yes\",\"\"))","v":""},{"$f":"IF('Mix Info'!D2=\"\",\"\", IF(AND(('Mix Info'!D6+'Mix Info'!D9)>45, 'Mix Info'!D2=\"HPC-O\"), \"Yes\",\"\"))","v":""},{"$f":"IF('Mix Info'!E2=\"\",\"\", IF(AND(('Mix Info'!E6+'Mix Info'!E9)>45, 'Mix Info'!E2=\"HPC-O\"), \"Yes\",\"\"))","v":""},{"$f":"IF('Mix Info'!F2=\"\",\"\", IF(AND(('Mix Info'!F6+'Mix Info'!F9)>45, 'Mix Info'!F2=\"HPC-O\"), \"Yes\",\"\"))","v":""}]
[null,null,null,null,{"$f":"IF(B11=\"\",\"\",IF(OR('Mix Info'!R13<>\"\", 'Mix Info'!R14<>\"\", 'Mix Info'!R15<>\"\", 'Mix Info'!R16<>\"\"),\"Over The Maximum Allowable FlyAsh %.\",\"\"))","v":""}]
[null,"Adjusted Cement:",{"$f":"IF(B7=\"FM-Non Critical Fluidity\", \"100\", IF(B7=\"FM-Critical Fluidity\", \"100\",IF(E820150A!B34=\"\",\"\",E820150A!B34)))","v":""},{"$f":"IF('Proj Info'!$B$1=\"M\",$J$2,$K$2)","v":"lbs"},{"$f":"IF(B13=\"\",\"\",IF(OR('Mix Info'!R9<>\"\",'Mix Info'!R10<>\"\", 'Mix Info'!R11<>\"\", 'Mix Info'!R12<>\"\", 'Mix Info'!R17<>\"\", 'Mix Info'!R18<>\"\", 'Mix Info'!R19<>\"\", 'Mix Info'!R20<>\"\"),\"Over The Maximum Allowable Slag %.\",\"\"))","v":""}]
[null,null,null,null,{"$f":"IF(G19=\"\",\"\",IF(OR(J14<>\"\",J15<>\"\"),\"Over The Maximum Allowable Cement Replacement.\",\"\"))","v":""}]
[null,"              Total Cementitious",{"$f":"IF(B7=\"FM-Non Critical Fluidity\",\"400\", IF(B7=\"FM-Critical Fluidity\",\"500\",IF(B9=\"\",\"\",C11+C13+C17)))","v":""},{"$f":"IF('Proj Info'!$B$1=\"M\",$J$2,$K$2)","v":"lbs"},null,"Total % Replacement =",{"$f":"IF(B7=\"FM-Non Critical Fluidity\",\"\", IF(B7=\"FM-Critical Fluidity\",\"\",IF(B7=\"\",\"\",E820150A!P35)))","v":""}]
[]
["IM T203","Fine Aggregate Source: ",null,{"$f":"IF(AND('Proj Info'!B46=\"\",'Proj Info'!C46=\"\"),\"\", IF('Proj Info'!B46<>\"\",'Proj Info'!B46,'Proj Info'!C46))","v":""},null,null,"Sp. Gr.: ",{"$f":"E820150A!B9","v":""}]
["IM T203","Interm. Aggregate Source: ",null,{"$f":"IF(AND('Proj Info'!B44=\"\",'Proj Info'!C44=\"\"),\"\",IF( 'Proj Info'!B44<>\"\",'Proj Info'!B44,'Proj Info'!C44))","v":""},null,null,"Sp. Gr.: ",{"$f":"E820150A!B10","v":""}]
["IM T203","Coarse Agregate Source: ",null,{"$f":"IF(AND('Proj Info'!B42=\"\",'Proj Info'!C42=\"\"), \"\", IF('Proj Info'!B42<>\"\",'Proj Info'!B42,'Proj Info'!C42))","v":""},null,null,"Sp. Gr.: ",{"$f":"E820150A!B11","v":""}]
[]
["Basic w/c",{"$f":"IF(E7=\"\",\"\",H25/B9)","v":""},"Water",{"$f":"IF('Proj Info'!$B$1=\"M\",$J$3,$K$3)","v":"lbs/cy"},"= Basic w/c X (Total Cementitious)           =",null,null,{"$f":"IF(B7=\"FM-Non Critical Fluidity\",\"583.1\", IF(B7=\"FM-Critical Fluidity\",\"583.1\",IF(E820150A!B37=\"\",\"\",E820150A!B37)))","v":""}]
["Max w/c",{"$f":"IF(B7=\"\",\"\",E820150A!B41)","v":""},"Max. Water",{"$f":"IF('Proj Info'!$B$1=\"M\",$J$3,$K$3)","v":"lbs/cy"},"= Max w/c X (Total Cementitious)             =",null,null,{"$f":"IF(E7=\"\",\"\",C19*B26)","v":""}]
[]
["Absolute  Volumes","Cement",".............................................",null,{"$f":"IF('Proj Info'!$B$1=\"M\",$J$1,$K$1)","v":"(lbs/cy) / ( Sp. Gr. X 62.4 X 27)           ="},null,null,{"$f":"E820150A!B14","v":""}]
[]
[null,"Fly Ash",".............................................",null,{"$f":"IF('Proj Info'!$B$1=\"M\",$J$1,$K$1)","v":"(lbs/cy) / ( Sp. Gr. X 62.4 X 27)           ="},null,null,{"$f":"E820150A!B15","v":""}]
[]
[null,"                Slag",".............................................",null,{"$f":"IF('Proj Info'!$B$1=\"M\",$J$1,$K$1)","v":"(lbs/cy) / ( Sp. Gr. X 62.4 X 27)           ="},null,null,{"$f":"E820150A!B16","v":""}]
[]
[null,"Water",".............................................",null,{"$f":"IF('Proj Info'!$B$1=\"M\",$J$1,$K$1)","v":"(lbs/cy) / ( Sp. Gr. X 62.4 X 27)           ="},null,null,{"$f":"E820150A!B17","v":""}]
[]
[null,"Air","......................................................................................................................",null,null,null,null,{"$f":"E820150A!B18","v":0.06}]
[]
[null,null,null,null,null,"Subtotal","= ",{"$f":"IF(H28=\"\",\"\",SUM(H28:H36))","v":""}]
[null,null,null,null,null,"1.000 - Subtotal","= ",{"$f":"IF(H28=\"\",\"\",(1-SUM(H28:H36)))","v":""}]
[null,null,null,null,null,"Total","= ",1]
[]
["%  FA  Agg.: ",{"$f":"IF(E820150A!B22=\"\",\"\",IF(E820150A!B22=0,\"\",E820150A!B22))","v":""},"Fine  Aggregate ( 1.000 - Subtotal ) X % In Mix",null,null,null,"= ",{"$f":"E820150A!B29","v":""}]
["%  In.  Agg.: ",{"$f":"IF(E820150A!B23=\"\",\"\",IF(E820150A!B23=0,\"\",E820150A!B23))","v":""},"Interm.  Aggregate ( 1.000 - Subtotal ) X % In Mix",null,null,null,"= ",{"$f":"E820150A!B30","v":""}]
["%  CA  Agg.: ",{"$f":"IF(E820150A!B24=\"\",\"\",IF(E820150A!B24=0,\"\",E820150A!B24))","v":""},"Coarse  Aggregate ( 1.000 - Subtotal ) X % In Mix",null,null,null,"= ",{"$f":"E820150A!B31","v":""}]
[null,null,null,null,"Aggregate  Total",null,"= ",{"$f":"IF(H42=\"\",\"\",SUM(H42:H44))","v":""}]
[]
["Aggregate  Weights",null,"Fine:",{"$f":"IF('Proj Info'!$B$1=\"M\",$J$4,$K$4)","v":"Abs Vol. X Sp. Gr. X 62.4 X 27"},null,null,"= ",{"$f":"IF(B7=\"FM-Non Critical Fluidity\",\"2600\", IF(B7=\"FM-Critical Fluidity\",\"2600\",IF(E820150A!B38=\"\",\"\",E820150A!B38)))","v":0}]
[]
[null,null,"Intermediate:",{"$f":"IF('Proj Info'!$B$1=\"M\",$J$4,$K$4)","v":"Abs Vol. X Sp. Gr. X 62.4 X 27"},null,null,"= ",{"$f":"E820150A!B39","v":0}]
[]
[null,null,"Coarse:",{"$f":"IF('Proj Info'!$B$1=\"M\",$J$4,$K$4)","v":"Abs Vol. X Sp. Gr. X 62.4 X 27"},null,null,"= ",{"$f":"E820150A!B40","v":0}]
[]
["Summary",null,null,"Cement ",{"$f":"C17","v":""},{"$f":"IF('Proj Info'!$B$1=\"M\",$J$3,$K$3)","v":"lbs/cy"}]
[null,null,null,"Fly Ash ",{"$f":"C11","v":""},{"$f":"IF('Proj Info'!$B$1=\"M\",$J$3,$K$3)","v":"lbs/cy"}]
["Plant Name & Location:",{"$f":"IF('Proj Info'!B10=\"\",\"\", 'Proj Info'!B10)","v":""},null,"Slag",{"$f":"C13","v":""},{"$f":"IF('Proj Info'!$B$1=\"M\",$J$3,$K$3)","v":"lbs/cy"}]
["CPI:",{"$f":"IF('Proj Info'!B78=\"\",\"\", 'Proj Info'!B78)","v":""},null,"Water ",{"$f":"$H$25","v":""},{"$f":"IF('Proj Info'!$B$1=\"M\",$J$3,$K$3)","v":"lbs/cy"}]
["Cert #:",{"$f":"IF('Proj Info'!B79=\"\",\"\", 'Proj Info'!B79)","v":""},null,"Fine Agg. ",{"$f":"$H$47","v":0},{"$f":"IF('Proj Info'!$B$1=\"M\",$J$3,$K$3)","v":"lbs/cy"}]
[null,null,null,"Interm. Agg. ",{"$f":"$H$49","v":0},{"$f":"IF('Proj Info'!$B$1=\"M\",$J$3,$K$3)","v":"lbs/cy"}]
[null,null,null,"Coarse Agg. ",{"$f":"$H$51","v":0},{"$f":"IF('Proj Info'!$B$1=\"M\",$J$3,$K$3)","v":"lbs/cy"}]
[]
[]
[null,null,null,"Air Entrainment: ",{"$f":"IF(AND('Proj Info'!B48=\"\",'Proj Info'!C48=\"\"),\"\", IF('Proj Info'!B48<>\"\",'Proj Info'!B48,'Proj Info'!C48))","v":""},null,"Rate: ",{"$f":"IF(AND('Proj Info'!B49=\"\",'Proj Info'!C49=\"\"),\"\", IF('Proj Info'!B49<>\"\",'Proj Info'!B49,'Proj Info'!C49))","v":""}]
[null,null,null,"Normal Water Reducer: ",{"$f":"IF(AND('Proj Info'!B51=\"\",'Proj Info'!C51=\"\"),\"\", IF('Proj Info'!B51<>\"\",'Proj Info'!B51,'Proj Info'!C51))","v":""},null,"Rate: ",{"$f":"IF(AND('Proj Info'!B52=\"\",'Proj Info'!C52=\"\"),\"\", IF('Proj Info'!B52<>\"\",'Proj Info'!B52,'Proj Info'!C52))","v":""}]
[null,null,null,"Mid-Range Water Reducer: ",{"$f":"IF(AND('Proj Info'!B54=\"\",'Proj Info'!C54=\"\"),\"\", IF('Proj Info'!B54<>\"\",'Proj Info'!B54,'Proj Info'!C54))","v":""},null,"Rate: ",{"$f":"IF(AND('Proj Info'!B55=\"\",'Proj Info'!C55=\"\"),\"\", IF('Proj Info'!B55<>\"\",'Proj Info'!B55,'Proj Info'!C55))","v":""}]
[null,null,null,"High-Range Water Reducer: ",{"$f":"IF(AND('Proj Info'!B57=\"\",'Proj Info'!C57=\"\"),\"\", IF('Proj Info'!B57<>\"\",'Proj Info'!B57,'Proj Info'!C57))","v":""},null,"Rate: ",{"$f":"IF(AND('Proj Info'!B58=\"\",'Proj Info'!C58=\"\"),\"\", IF('Proj Info'!B58<>\"\",'Proj Info'!B58,'Proj Info'!C58))","v":""}]
[null,null,null,"Retarder: ",{"$f":"IF(AND('Proj Info'!B60=\"\",'Proj Info'!C60=\"\"),\"\", IF('Proj Info'!B60<>\"\",'Proj Info'!B60,'Proj Info'!C60))","v":""},null,"Rate: ",{"$f":"IF(AND('Proj Info'!B61=\"\",'Proj Info'!C61=\"\"),\"\", IF('Proj Info'!B61<>\"\",'Proj Info'!B61,'Proj Info'!C61))","v":""}]
[null,null,null,"Special Performance Admixture: ",{"$f":"IF(AND('Proj Info'!B63=\"\",'Proj Info'!C63=\"\"),\"\", IF('Proj Info'!B63<>\"\",'Proj Info'!B63,'Proj Info'!C63))","v":""},null,"Rate: ",{"$f":"IF(AND('Proj Info'!B64=\"\",'Proj Info'!C64=\"\"),\"\", IF('Proj Info'!B64<>\"\",'Proj Info'!B64,'Proj Info'!C64))","v":""}]
[null,null,null,"Fibers: ",{"$f":"IF(AND('Proj Info'!B69=\"\",'Proj Info'!C69=\"\"),\"\", IF('Proj Info'!B69<>\"\",'Proj Info'!B69,'Proj Info'!C69))","v":""},null,"Rate: ",{"$f":"IF('Proj Info'!B70=\"\",\"\",'Proj Info'!B70)","v":""}]
[null,null,null,{"$f":"IF(AND('Proj Info'!B71=\"\",'Proj Info'!C71=\"\"),\"CO2 Admix: \",IF('Proj Info'!B71<>\"\",_xlfn.CONCAT('Proj Info'!B71,\": \"),_xlfn.CONCAT('Proj Info'!C71,\": \")))","v":"CO2 Admix: "},null,null,"oz/cy: ",{"$f":"IF('Proj Info'!$B$72=\"\",\"\",'Proj Info'!$B$72)","v":""}]
["Distribution:   ___  DME,  ___  Proj. Engr.,  ___  Contractor"]

{"sheet":"Batch Wts.","index":4,"n_rows":30,"n_cols":7,"rows_kept":30,"cut":false,"hidden":false,"merged":[]}
["Absolute Volume",1,2,3,4,5,{"$f":"IF('Proj Info'!B1=\"E\",\"'E - Units\",\"M - Units\")","v":"'E - Units"}]
["Cement:",{"$f":"IF(E820150A!B14=\"\",\"\",E820150A!B14)","v":""},{"$f":"IF(E820150A!C14=\"\",\"\",E820150A!C14)","v":""},{"$f":"IF(E820150A!D14=\"\",\"\",E820150A!D14)","v":""},{"$f":"IF(E820150A!E14=\"\",\"\",E820150A!E14)","v":""},{"$f":"IF(E820150A!F14=\"\",\"\",E820150A!F14)","v":""}]
["Fly Ash:",{"$f":"IF(E820150A!B15=\"\",\"\",E820150A!B15)","v":""},{"$f":"IF(E820150A!C15=\"\",\"\",E820150A!C15)","v":""},{"$f":"IF(E820150A!D15=\"\",\"\",E820150A!D15)","v":""},{"$f":"IF(E820150A!E15=\"\",\"\",E820150A!E15)","v":""},{"$f":"IF(E820150A!F15=\"\",\"\",E820150A!F15)","v":""}]
["GGBFS:",{"$f":"IF(E820150A!B16=\"\",\"\",E820150A!B16)","v":""},{"$f":"IF(E820150A!C16=\"\",\"\",E820150A!C16)","v":""},{"$f":"IF(E820150A!D16=\"\",\"\",E820150A!D16)","v":""},{"$f":"IF(E820150A!E16=\"\",\"\",E820150A!E16)","v":""},{"$f":"IF(E820150A!F16=\"\",\"\",E820150A!F16)","v":""}]
["Water:",{"$f":"IF(E820150A!B17=\"\",\"\",E820150A!B17)","v":""},{"$f":"IF(E820150A!C17=\"\",\"\",E820150A!C17)","v":""},{"$f":"IF(E820150A!D17=\"\",\"\",E820150A!D17)","v":""},{"$f":"IF(E820150A!E17=\"\",\"\",E820150A!E17)","v":""},{"$f":"IF(E820150A!F17=\"\",\"\",E820150A!F17)","v":""}]
["Air:",{"$f":"IF(E820150A!B18=\"\",\"\",E820150A!B18)","v":0.06},{"$f":"IF(E820150A!C18=\"\",\"\",E820150A!C18)","v":0.06},{"$f":"IF(E820150A!D18=\"\",\"\",E820150A!D18)","v":0.06},{"$f":"IF(E820150A!E18=\"\",\"\",E820150A!E18)","v":0.06},{"$f":"IF(E820150A!F18=\"\",\"\",E820150A!F18)","v":0.06}]
["Fine:",{"$f":"IF(E820150A!B29=\"\",\"\",E820150A!B29)","v":""},{"$f":"IF(E820150A!C29=\"\",\"\",E820150A!C29)","v":""},{"$f":"IF(E820150A!D29=\"\",\"\",E820150A!D29)","v":""},{"$f":"IF(E820150A!E29=\"\",\"\",E820150A!E29)","v":""},{"$f":"IF(E820150A!F29=\"\",\"\",E820150A!F29)","v":""}]
["Intermediate:",{"$f":"IF(E820150A!B30=\"\",\"\",E820150A!B30)","v":""},{"$f":"IF(E820150A!C30=\"\",\"\",E820150A!C30)","v":""},{"$f":"IF(E820150A!D30=\"\",\"\",E820150A!D30)","v":""},{"$f":"IF(E820150A!E30=\"\",\"\",E820150A!E30)","v":""},{"$f":"IF(E820150A!F30=\"\",\"\",E820150A!F30)","v":""}]
["Coarse:",{"$f":"IF(E820150A!B31=\"\",\"\",E820150A!B31)","v":""},{"$f":"IF(E820150A!C31=\"\",\"\",E820150A!C31)","v":""},{"$f":"IF(E820150A!D31=\"\",\"\",E820150A!D31)","v":""},{"$f":"IF(E820150A!E31=\"\",\"\",E820150A!E31)","v":""},{"$f":"IF(E820150A!F31=\"\",\"\",E820150A!F31)","v":""}]
[]
["Wet Batch Wts. Per Cu. Yd. (Cu. m.)",1,2,3,4,5]
["Date: ",{"$f":"IF('Mix Info'!B3=\"\",\"\",('Mix Info'!B3))","v":""},{"$f":"IF('Mix Info'!C3=\"\",\"\",('Mix Info'!C3))","v":""},{"$f":"IF('Mix Info'!D3=\"\",\"\",('Mix Info'!D3))","v":""},{"$f":"IF('Mix Info'!E3=\"\",\"\",('Mix Info'!E3))","v":""},{"$f":"IF('Mix Info'!F3=\"\",\"\",('Mix Info'!F3))","v":""}]
["Lbs (kgs) of Cement: ",{"$f":"IF('Report '!O13=\"\",\"\",('Report '!O13))","v":""},{"$f":"IF('Report '!O$14=\"\",\"\",('Report '!O$14))","v":""},{"$f":"IF('Report '!O$15=\"\",\"\",('Report '!O$15))","v":""},{"$f":"IF('Report '!O$16=\"\",\"\",('Report '!O$16))","v":""},{"$f":"IF('Report '!O$17=\"\",\"\",('Report '!O$17))","v":""}]
["Lbs (kgs) of Fly Ash: ",{"$f":"IF('Report '!P$13=\"\",0,('Report '!P$13))","v":0},{"$f":"IF('Report '!P$14=\"\",0,('Report '!P$14))","v":0},{"$f":"IF('Report '!P$15=\"\",0,('Report '!P$15))","v":0},{"$f":"IF('Report '!P$16=\"\",0,('Report '!P$16))","v":0},{"$f":"IF('Report '!P$17=\"\",0,('Report '!P$17))","v":0}]
["Lbs (kgs) of GGBFS: ",{"$f":"IF('Report '!Q$13=\"\",0,('Report '!Q$13))","v":0},{"$f":"IF('Report '!Q$14=\"\",0,('Report '!Q$14))","v":0},{"$f":"IF('Report '!Q$15=\"\",0,('Report '!Q$15))","v":0},{"$f":"IF('Report '!Q$16=\"\",0,('Report '!Q$16))","v":0},{"$f":"IF('Report '!Q$17=\"\",0,('Report '!Q$17))","v":0}]
["Lbs (kgs) of Sand: ",{"$f":"IF('Report '!R$13=\"\",\"\",('Report '!R$13))","v":""},{"$f":"IF('Report '!R$14=\"\",\"\",('Report '!R$14))","v":""},{"$f":"IF('Report '!R$15=\"\",\"\",('Report '!R$15))","v":""},{"$f":"IF('Report '!R$16=\"\",\"\",('Report '!R$16))","v":""},{"$f":"IF('Report '!R$17=\"\",\"\",('Report '!R$17))","v":""}]
["Lbs (kgs) of Intermediate: ",{"$f":"IF('Report '!S$13=\"\",0,('Report '!S$13))","v":0},{"$f":"IF('Report '!S$14=\"\",0,('Report '!S$14))","v":0},{"$f":"IF('Report '!S$15=\"\",0,('Report '!S$15))","v":0},{"$f":"IF('Report '!S$16=\"\",0,('Report '!S$16))","v":0},{"$f":"IF('Report '!S$17=\"\",0,('Report '!S$17))","v":0}]
["Lbs (kgs) of Rock: ",{"$f":"IF('Report '!T$13=\"\",\"\",('Report '!T$13))","v":""},{"$f":"IF('Report '!T$14=\"\",\"\",('Report '!T$14))","v":""},{"$f":"IF('Report '!T$15=\"\",\"\",('Report '!T$15))","v":""},{"$f":"IF('Report '!T$16=\"\",\"\",('Report '!T$16))","v":""},{"$f":"IF('Report '!T$17=\"\",\"\",('Report '!T$17))","v":""}]
["Gal. (L) of H2O In Agg: ",{"$f":"IF('Report '!$U13=\"\",\"\",IF('Proj Info'!$B$1=\"E\",SUM('Report '!$U13/8.33),SUM('Report '!$U13)))","v":""},{"$f":"IF('Report '!$U14=\"\",\"\",IF('Proj Info'!$B$1=\"E\",SUM('Report '!$U14/8.33),SUM('Report '!$U14)))","v":""},{"$f":"IF('Report '!$U15=\"\",\"\",IF('Proj Info'!$B$1=\"E\",SUM('Report '!$U15/8.33),SUM('Report '!$U15)))","v":""},{"$f":"IF('Report '!$U16=\"\",\"\",IF('Proj Info'!$B$1=\"E\",SUM('Report '!$U16/8.33),SUM('Report '!$U16)))","v":""},{"$f":"IF('Report '!$U17=\"\",\"\",IF('Proj Info'!$B$1=\"E\",SUM('Report '!$U17/8.33),SUM('Report '!$U17)))","v":""}]
["Max. Gal. (L) of H20 Allowed: ",{"$f":"IF(B21=\"\",\"\",IF('Proj Info'!$B$1=\"E\",ROUND((B21/8.33),1),IF('Proj Info'!$B$1=\"M\",ROUND((B21),1))))","v":""},{"$f":"IF(C21=\"\",\"\",IF('Proj Info'!$B$1=\"E\",ROUND((C21/8.33),1),IF('Proj Info'!$B$1=\"M\",ROUND((C21),1))))","v":""},{"$f":"IF(D21=\"\",\"\",IF('Proj Info'!$B$1=\"E\",ROUND((D21/8.33),1),IF('Proj Info'!$B$1=\"M\",ROUND((D21),1))))","v":""},{"$f":"IF(E21=\"\",\"\",IF('Proj Info'!$B$1=\"E\",ROUND((E21/8.33),1),IF('Proj Info'!$B$1=\"M\",ROUND((E21),1))))","v":""},{"$f":"IF(F21=\"\",\"\",IF('Proj Info'!$B$1=\"E\",ROUND((F21/8.33),1),IF('Proj Info'!$B$1=\"M\",ROUND((F21),1))))","v":""}]
[null,{"$f":"IF('Report '!$Y13=\"\",\"\",ROUND((SUM(B13+B14+B15)*'Report '!$Y13),1))","v":""},{"$f":"IF('Report '!$Y14=\"\",\"\",ROUND((SUM(C13+C14+C15)*'Report '!$Y14),1))","v":""},{"$f":"IF('Report '!$Y15=\"\",\"\",ROUND(((D13+D14+D15)*'Report '!$Y15),1))","v":""},{"$f":"IF('Report '!$Y16=\"\",\"\",ROUND(((E13+E14+E15)*'Report '!$Y16),1))","v":""},{"$f":"IF('Report '!$Y17=\"\",\"\",ROUND(((F13+F14+F15)*'Report '!$Y17),1))","v":""}]
["Cu. Yds. (Cu. m) Per Load Batched: "]
["Lbs (kgs) Per Load, Cement: ",{"$f":"IF($B$22=\"\",\"\",($B$22*B13))","v":""},{"$f":"IF($C$22=\"\",\"\",($C$22*C13))","v":""},{"$f":"IF($D$22=\"\",\"\",($D$22*D13))","v":""},{"$f":"IF($E$22=\"\",\"\",($E$22*E13))","v":""},{"$f":"IF($F$22=\"\",\"\",($F$22*F13))","v":""}]
["Lbs (kgs) Per Load, Fly Ash: ","","","","",""]
["Lbs (kgs) Per Load, GGBFS: ","","","","",""]
["Lbs (kgs) Per Load, Sand: ","","","","",""]
["Lbs (kgs) Per Load, Intermediate: ","","","","",""]
["Lbs (kgs) Per Load, Rock: ","","","","",""]
["H20 In Agg. Per Load: ","","","","",""]
["Max. H2O Allowed Per Load: ","","","","",""]

{"sheet":"E820150A","index":5,"n_rows":100,"n_cols":16,"rows_kept":100,"cut":false,"hidden":true,"merged":[]}
[null,1,2,3,"4",5,{"$f":"'Proj Info'!B1","v":"E"}]
["Mix No.:",{"$f":"IF('Mix Info'!B2=\"\",\"\",'Mix Info'!B2)","v":""},{"$f":"IF('Mix Info'!C2=\"\",\"\",'Mix Info'!C2)","v":""},{"$f":"IF('Mix Info'!D2=\"\",\"\",'Mix Info'!D2)","v":""},{"$f":"IF('Mix Info'!E2=\"\",\"\",'Mix Info'!E2)","v":""},{"$f":"IF('Mix Info'!F2=\"\",\"\",'Mix Info'!F2)","v":""},{"$f":"IF(G1=\"E\",PRODUCT(62.4*27),IF(G1=\"M\",\"1000\",0))","v":1684.8}]
["Cement Type:",{"$f":"IF('Mix Info'!B$4=\"\",\"\",('Mix Info'!B$4))","v":""},{"$f":"IF('Mix Info'!C$4=\"\",\"\",('Mix Info'!C$4))","v":""},{"$f":"IF('Mix Info'!D$4=\"\",\"\",('Mix Info'!D$4))","v":""},{"$f":"IF('Mix Info'!E$4=\"\",\"\",('Mix Info'!E$4))","v":""},{"$f":"IF('Mix Info'!F$4=\"\",\"\",('Mix Info'!F$4))","v":""}]
["Cem. Sp. Gr.:",{"$f":"IF('Mix Info'!B5=\"\",\"\",('Mix Info'!B5))","v":""},{"$f":"IF('Mix Info'!C5=\"\",\"\",('Mix Info'!C5))","v":""},{"$f":"IF('Mix Info'!D5=\"\",\"\",('Mix Info'!D5))","v":""},{"$f":"IF('Mix Info'!E5=\"\",\"\",('Mix Info'!E5))","v":""},{"$f":"IF('Mix Info'!F5=\"\",\"\",('Mix Info'!F5))","v":""}]
["%  Fly Ash:",{"$f":"IF('Mix Info'!B2=\"FM\",\"\",IF('Mix Info'!B6=0,\"\",'Mix Info'!B6))","v":""},{"$f":"IF('Mix Info'!C2=\"FM\",\"\",IF('Mix Info'!C6=0,\"\",'Mix Info'!C6))","v":""},{"$f":"IF('Mix Info'!D2=\"FM\",\"\",IF('Mix Info'!D6=0,\"\",'Mix Info'!D6))","v":""},{"$f":"IF('Mix Info'!E2=\"FM\",\"\",IF('Mix Info'!E6=0,\"\",'Mix Info'!E6))","v":""},{"$f":"IF('Mix Info'!F2=\"FM\",\"\",IF('Mix Info'!F6=0,\"\",'Mix Info'!F6))","v":""}]
["Fly Ash SP. G.:",{"$f":"IF('Mix Info'!B8=\"\",\"\",'Mix Info'!B8)","v":""},{"$f":"IF('Mix Info'!C8=\"\",\"\",'Mix Info'!C8)","v":""},{"$f":"IF('Mix Info'!D8=\"\",\"\",'Mix Info'!D8)","v":""},{"$f":"IF('Mix Info'!E8=\"\",\"\",'Mix Info'!E8)","v":""},{"$f":"IF('Mix Info'!F8=\"\",\"\",'Mix Info'!F8)","v":""}]
["%  GGBFS:",{"$f":"IF('Mix Info'!B9=\"\",\"\",IF('Mix Info'!B9=0,\"\",'Mix Info'!B9))","v":""},{"$f":"IF('Mix Info'!C9=\"\",\"\",IF('Mix Info'!C9=0,\"\",'Mix Info'!C9))","v":""},{"$f":"IF('Mix Info'!D9=\"\",\"\",IF('Mix Info'!D9=0,\"\",'Mix Info'!D9))","v":""},{"$f":"IF('Mix Info'!E9=\"\",\"\",IF('Mix Info'!E9=0,\"\",'Mix Info'!E9))","v":""},{"$f":"IF('Mix Info'!F9=\"\",\"\",IF('Mix Info'!F9=0,\"\",'Mix Info'!F9))","v":""}]
["GGBFS SP. G.:",{"$f":"IF('Mix Info'!B10=\"\",\"\",'Mix Info'!B10)","v":""},{"$f":"IF('Mix Info'!C10=\"\",\"\",'Mix Info'!C10)","v":""},{"$f":"IF('Mix Info'!D10=\"\",\"\",'Mix Info'!D10)","v":""},{"$f":"IF('Mix Info'!E10=\"\",\"\",'Mix Info'!E10)","v":""},{"$f":"IF('Mix Info'!F10=\"\",\"\",'Mix Info'!F10)","v":""}]
["Fine Sp. Gr.:",{"$f":"IF('Mix Info'!B11=\"\",\"\",'Mix Info'!B11)","v":""},{"$f":"IF('Mix Info'!C11=\"\",\"\",'Mix Info'!C11)","v":""},{"$f":"IF('Mix Info'!D11=\"\",\"\",'Mix Info'!D11)","v":""},{"$f":"IF('Mix Info'!E11=\"\",\"\",'Mix Info'!E11)","v":""},{"$f":"IF('Mix Info'!F11=\"\",\"\",'Mix Info'!F11)","v":""}]
["Interm. Sp. Gr.:",{"$f":"IF('Mix Info'!B12=\"\",\"\",'Mix Info'!B12)","v":""},{"$f":"IF('Mix Info'!C12=\"\",\"\",'Mix Info'!C12)","v":""},{"$f":"IF('Mix Info'!D12=\"\",\"\",'Mix Info'!D12)","v":""},{"$f":"IF('Mix Info'!E12=\"\",\"\",'Mix Info'!E12)","v":""},{"$f":"IF('Mix Info'!F12=\"\",\"\",'Mix Info'!F12)","v":""}]
["CA Sp. Gr.:",{"$f":"IF('Mix Info'!B13=\"\",\"\",'Mix Info'!B13)","v":""},{"$f":"IF('Mix Info'!C13=\"\",\"\",'Mix Info'!C13)","v":""},{"$f":"IF('Mix Info'!D13=\"\",\"\",'Mix Info'!D13)","v":""},{"$f":"IF('Mix Info'!E13=\"\",\"\",'Mix Info'!E13)","v":""},{"$f":"IF('Mix Info'!F13=\"\",\"\",'Mix Info'!F13)","v":""}]
[]
["Cem Abs.",{"$f":"IF(B2=\"FM\",\"\",IF(B4=\"\",\"\",VLOOKUP(B2,$B$44:$H$100,2,FALSE)))","v":""},{"$f":"IF(C2=\"FM\",\"\",IF(C4=\"\",\"\",VLOOKUP(C2,$B$44:$H$100,2,FALSE)))","v":""},{"$f":"IF(D2=\"FM\",\"\",IF(D4=\"\",\"\",VLOOKUP(D2,$B$44:$H$100,2,FALSE)))","v":""},{"$f":"IF(E2=\"FM\",\"\",IF(E4=\"\",\"\",VLOOKUP(E2,$B$44:$H$100,2,FALSE)))","v":""},{"$f":"IF(F2=\"FM\",\"\",IF(F4=\"\",\"\",VLOOKUP(F2,$B$44:$H$100,2,FALSE)))","v":""}]
["Adj. Cem Abs.",{"$f":"IF(B2=\"FM\",\"\",IF(B4=\"\",\"\",ROUND(((B34/(B4*$G$2))),3)))","v":""},{"$f":"IF(C2=\"FM\",\"\",IF(C4=\"\",\"\",ROUND(((C34/(C4*$G$2))),3)))","v":""},{"$f":"IF(D2=\"FM\",\"\",IF(D4=\"\",\"\",ROUND(((D34/(D4*$G$2))),3)))","v":""},{"$f":"IF(E2=\"FM\",\"\",IF(E4=\"\",\"\",ROUND(((E34/(E4*$G$2))),3)))","v":""},{"$f":"IF(F2=\"FM\",\"\",IF(F4=\"\",\"\",ROUND(((F34/(F4*$G$2))),3)))","v":""}]
["Fly Ash Abs.",{"$f":"IF(B5=0,\"\",IF(B5=\"\",\"\",ROUND((B35/(B6*$G$2)),3)))","v":""},{"$f":"IF(C5=0,\"\",IF(C5=\"\",\"\",ROUND((C35/(C6*$G$2)),3)))","v":""},{"$f":"IF(D5=0,\"\",IF(D5=\"\",\"\",ROUND((D35/(D6*$G$2)),3)))","v":""},{"$f":"IF(E5=0,\"\",IF(E5=\"\",\"\",ROUND((E35/(E6*$G$2)),3)))","v":""},{"$f":"IF(F5=0,\"\",IF(F5=\"\",\"\",ROUND((F35/(F6*$G$2)),3)))","v":""}]
["GGBFS Abs.",{"$f":"IF(B7=\"\",\"\",IF(B7=0,\"\",ROUND((B36/(B8*$G$2)),3)))","v":""},{"$f":"IF(C7=\"\",\"\",IF(C7=0,\"\",ROUND((C36/(C8*$G$2)),3)))","v":""},{"$f":"IF(D7=\"\",\"\",IF(D7=0,\"\",ROUND((D36/(D8*$G$2)),3)))","v":""},{"$f":"IF(E7=\"\",\"\",IF(E7=0,\"\",ROUND((E36/(E8*$G$2)),3)))","v":""},{"$f":"IF(F7=\"\",\"\",IF(F7=0,\"\",ROUND((F36/(F8*$G$2)),3)))","v":""}]
["Water Abs.",{"$f":"IF(B2=\"FM\",\"\",IF(B37=\"\",\"\",(B37/$G$2)))","v":""},{"$f":"IF(C2=\"FM\",\"\",IF(C37=\"\",\"\",(C37/$G$2)))","v":""},{"$f":"IF(D2=\"FM\",\"\",IF(D37=\"\",\"\",(D37/$G$2)))","v":""},{"$f":"IF(E2=\"FM\",\"\",IF(E37=\"\",\"\",(E37/$G$2)))","v":""},{"$f":"IF(F2=\"FM\",\"\",IF(F37=\"\",\"\",(F37/$G$2)))","v":""}]
["Air Abs.",{"$f":"IF('Mix Info'!B2=\"X-2\",0,IF('Mix Info'!B2=\"X-3\",0,IF('Mix Info'!B2=\"X-4\",0,0.06)))","v":0.06},{"$f":"IF('Mix Info'!C2=\"X-2\",0,IF('Mix Info'!C2=\"X-3\",0,IF('Mix Info'!C2=\"X-4\",0,0.06)))","v":0.06},{"$f":"IF('Mix Info'!D2=\"X-2\",0,IF('Mix Info'!D2=\"X-3\",0,IF('Mix Info'!D2=\"X-4\",0,0.06)))","v":0.06},{"$f":"IF('Mix Info'!E2=\"X-2\",0,IF('Mix Info'!E2=\"X-3\",0,IF('Mix Info'!E2=\"X-4\",0,0.06)))","v":0.06},{"$f":"IF('Mix Info'!F2=\"X-2\",0,IF('Mix Info'!F2=\"X-3\",0,IF('Mix Info'!F2=\"X-4\",0,0.06)))","v":0.06}]
["Subtotal",{"$f":"IF(B17=\"\",\"\",SUM(B14:B18))","v":""},{"$f":"IF(C17=\"\",\"\",SUM(C14:C18))","v":""},{"$f":"IF(D17=\"\",\"\",SUM(D14:D18))","v":""},{"$f":"IF(E17=\"\",\"\",SUM(E14:E18))","v":""},{"$f":"IF(F17=\"\",\"\",SUM(F14:F18))","v":""}]
["1 - Subtotal",{"$f":"IF(B19=\"\",\"\",ROUND((B21-B19),3))","v":""},{"$f":"IF(C19=\"\",\"\",ROUND((C21-C19),3))","v":""},{"$f":"IF(D19=\"\",\"\",ROUND((D21-D19),3))","v":""},{"$f":"IF(E19=\"\",\"\",ROUND((E21-E19),3))","v":""},{"$f":"IF(F19=\"\",\"\",ROUND((F21-F19),3))","v":""}]
["Total",1,1,1,1,1]
["%  FA  Agg.:",{"$f":"IF(B20=\"\",0,VLOOKUP(B$2,$B44:$H100,3,FALSE))","v":0},{"$f":"IF(C20=\"\",0,VLOOKUP(C$2,$B44:$H100,3,FALSE))","v":0},{"$f":"IF(D20=\"\",0,VLOOKUP(D$2,$B44:$H100,3,FALSE))","v":0},{"$f":"IF(E20=\"\",0,VLOOKUP(E$2,$B44:$H100,3,FALSE))","v":0},{"$f":"IF(F20=\"\",0,VLOOKUP(F$2,$B44:$H100,3,FALSE))","v":0}]
["%  Interm.  Agg.:",{"$f":"IF(B20=\"\",0,VLOOKUP(B$2,$B44:$H100,7,FALSE))","v":0},{"$f":"IF(C20=\"\",0,VLOOKUP(C$2,$B44:$H100,7,FALSE))","v":0},{"$f":"IF(D20=\"\",0,VLOOKUP(D$2,$B44:$H100,7,FALSE))","v":0},{"$f":"IF(E20=\"\",0,VLOOKUP(E$2,$B44:$H100,7,FALSE))","v":0},{"$f":"IF(F20=\"\",0,VLOOKUP(F$2,$B44:$H100,7,FALSE))","v":0}]
["%  CA  Agg.:",{"$f":"IF(B20=\"\",0,VLOOKUP(B$2,$B44:$H100,4,FALSE))","v":0},{"$f":"IF(C20=\"\",0,VLOOKUP(C$2,$B44:$H100,4,FALSE))","v":0},{"$f":"IF(D20=\"\",0,VLOOKUP(D$2,$B44:$H100,4,FALSE))","v":0},{"$f":"IF(E20=\"\",0,VLOOKUP(E$2,$B44:$H100,4,FALSE))","v":0},{"$f":"IF(F20=\"\",0,VLOOKUP(F$2,$B44:$H100,4,FALSE))","v":0}]
["Fine Abs.",{"$f":"IF(B20=\"\",\"\",ROUND(((B20)*(B22/100)),3))","v":""},{"$f":"IF(C20=\"\",\"\",ROUND(((C20)*(C22/100)),3))","v":""},{"$f":"IF(D20=\"\",\"\",ROUND(((D20)*(D22/100)),3))","v":""},{"$f":"IF(E20=\"\",\"\",ROUND(((E20)*(E22/100)),3))","v":""},{"$f":"IF(F20=\"\",\"\",ROUND(((F20)*(F22/100)),3))","v":""}]
["Interm. Abs.",{"$f":"IF(B23=0,0,IF(B23=\"\",0,IF(B23=\"\",\"\",ROUND(((B20)*(B23/100)),3))))","v":0},{"$f":"IF(C23=0,0,IF(C23=\"\",0,IF(C23=\"\",\"\",ROUND(((C20)*(C23/100)),3))))","v":0},{"$f":"IF(D23=0,0,IF(D23=\"\",0,IF(D23=\"\",\"\",ROUND(((D20)*(D23/100)),3))))","v":0},{"$f":"IF(E23=0,0,IF(E23=\"\",0,IF(E23=\"\",\"\",ROUND(((E20)*(E23/100)),3))))","v":0},{"$f":"IF(F23=0,0,IF(F23=\"\",0,IF(F23=\"\",\"\",ROUND(((F20)*(F23/100)),3))))","v":0},null,null,null,null,"CO2 Admix %:",{"$f":"B32","v":0}]
["CA Abs.",{"$f":"IF(B20=\"\",\"\",ROUND(((B20)*(B24/100)),3))","v":""},{"$f":"IF(C20=\"\",\"\",ROUND(((C20)*(C24/100)),3))","v":""},{"$f":"IF(D20=\"\",\"\",ROUND(((D20)*(D24/100)),3))","v":""},{"$f":"IF(E20=\"\",\"\",ROUND(((E20)*(E24/100)),3))","v":""},{"$f":"IF(F20=\"\",\"\",ROUND(((F20)*(F24/100)),3))","v":""},null,null,null,null,null,{"$f":"IF(B32=0,0, B33-B34-B35-B36)","v":0}]
["Agg. Total",{"$f":"IF(B27=\"\",\"\",SUM(B25:B27))","v":""},{"$f":"IF(C27=\"\",\"\",SUM(C25:C27))","v":""},{"$f":"IF(D27=\"\",\"\",SUM(D25:D27))","v":""},{"$f":"IF(E27=\"\",\"\",SUM(E25:E27))","v":""},{"$f":"IF(F27=\"\",\"\",SUM(F25:F27))","v":""}]
["Adj. FA Abs.",{"$f":"IF(B25=\"\",\"\",ROUND((B20-B26-B27),3))","v":""},{"$f":"IF(C25=\"\",\"\",ROUND((C20-C26-C27),3))","v":""},{"$f":"IF(D25=\"\",\"\",ROUND((D20-D26-D27),3))","v":""},{"$f":"IF(E25=\"\",\"\",ROUND((E20-E26-E27),3))","v":""},{"$f":"IF(F25=\"\",\"\",ROUND((F20-F26-F27),3))","v":""},null,null,null,null,null,null,{"$f":"IF(B3=\"\",0, IF(B3<>\"\", VLOOKUP(B3,CEMENT!G4:I25,2,FALSE),0))","v":0}]
["Adj. Interm. Abs.",{"$f":"IF(B23=0,\"\",IF(B23=\"\",\"\",ROUND((B28-B27-B25),3)))","v":""},{"$f":"IF(C23=0,\"\",IF(C23=\"\",\"\",ROUND((C28-C27-C25),3)))","v":""},{"$f":"IF(D23=0,\"\",IF(D23=\"\",\"\",ROUND((D28-D27-D25),3)))","v":""},{"$f":"IF(E23=0,\"\",IF(E23=\"\",\"\",ROUND((E28-E27-E25),3)))","v":""},{"$f":"IF(F23=0,\"\",IF(F23=\"\",\"\",ROUND((F28-F27-F25),3)))","v":""}]
["Adj. CA Abs.",{"$f":"IF(B27=\"\",\"\",ROUND((B28-B25-B26),3))","v":""},{"$f":"IF(C27=\"\",\"\",ROUND((C28-C25-C26),3))","v":""},{"$f":"IF(D27=\"\",\"\",ROUND((D28-D25-D26),3))","v":""},{"$f":"IF(E27=\"\",\"\",ROUND((E28-E25-E26),3))","v":""},{"$f":"IF(F27=\"\",\"\",ROUND((F28-F25-F26),3))","v":""}]
["CO2 Admix (%)",{"$f":"'Mix Info'!B27","v":0},{"$f":"'Mix Info'!C27","v":0},{"$f":"'Mix Info'!D27","v":0},{"$f":"'Mix Info'!E27","v":0},{"$f":"'Mix Info'!F27","v":0}]
["Cement",{"$f":"IF(B2=\"FM\",\"\",IF(B13=\"\",\"\",ROUND((B13*B4*$G$2),0)))","v":""},{"$f":"IF(C2=\"FM\",\"\",IF(C13=\"\",\"\",ROUND((C13*C4*$G$2),0)))","v":""},{"$f":"IF(D2=\"FM\",\"\",IF(D13=\"\",\"\",ROUND((D13*D4*$G$2),0)))","v":""},{"$f":"IF(E2=\"FM\",\"\",IF(E13=\"\",\"\",ROUND((E13*E4*$G$2),0)))","v":""},{"$f":"IF(F2=\"FM\",\"\",IF(F13=\"\",\"\",ROUND((F13*F4*$G$2),0)))","v":""},{"$f":"IF($B$3=\"\",0,IF($B$3=\"IS(20)\",($B$33*0.8),IF($B3=\"IS(25)\",$B$33*0.75,IF($B3=\"IP(25)\",$B$33*0.75,IF($B3=\"IL(10)\",$B$33*0.9,$B$33)))))","v":0},{"$f":"IF($B$3=\"IS(20)\",($B$33-$G$33),IF($B3=\"IS(25)\",($B$33-$G$33),IF($B3=\"IP(25)\",($B$33-$G$33),IF($B3=\"IL(10)\",($B$33-$G$33),0))))","v":0},null,null,null,{"$f":"IF(B3=\"\",0, IF(B3<>\"\", (B33*L34),B33))","v":0},{"$f":"IF(B3=\"\",0, IF(B3<>\"\", (B33-L33),0))","v":0}]
["Adj. Cement",{"$f":"IF(B2=\"FM\",\"\",IF(B4=\"\",\"\",(B33-B35-B36)*(1-B32/100)))","v":""},{"$f":"IF(C2=\"FM\",\"\",IF(C4=\"\",\"\",(C33-C35-C36)*(1-B32/100)))","v":""},{"$f":"IF(D2=\"FM\",\"\",IF(D4=\"\",\"\",(D33-D35-D36)*(1-B32/100)))","v":""},{"$f":"IF(E2=\"FM\",\"\",IF(E4=\"\",\"\",(E33-E35-E36)*(1-B32/100)))","v":""},{"$f":"IF(F2=\"FM\",\"\",IF(F4=\"\",\"\",(F33-F35-F36)*(1-B32/100)))","v":""},{"$f":"IF($B$3=\"IS(20)\",0.8,IF($B$3=\"IS(25)\",0.75,IF($B$3=\"IP(25)\",0.75,IF($B$3=\"IL(10)\",0.9,1))))","v":1},null,null,null,null,{"$f":"IF(B3=\"\",0, IF(B3<>\"\", VLOOKUP(B3,CEMENT!G4:I25,3,FALSE),0))","v":0}]
["Fly Ash",{"$f":"IF(B5=\"\",0,ROUND(((B33)*(B5/100)),0))","v":0},{"$f":"IF(C5=\"\",0,ROUND(((C33)*(C5/100)),0))","v":0},{"$f":"IF(D5=\"\",0,ROUND(((D33)*(D5/100)),0))","v":0},{"$f":"IF(E5=\"\",0,ROUND(((E33)*(E5/100)),0))","v":0},{"$f":"IF(F5=\"\",0,ROUND(((F33)*(F5/100)),0))","v":0},{"$f":"$B$34*$G$34","v":{"$error":"#VALUE!"}},{"$f":"IF($B$3=\"IS(20)\",($B$34*0.2),IF($B$3=\"IS(25)\",($B$34*0.25),IF($B$3=\"IP(25)\",($B$34*0.25),IF($B$3=\"IL(10)\",($B$34*0.1),0))))","v":0},{"$f":"$B$35+$B$36","v":0},{"$f":"G35+H35+I35","v":{"$error":"#VALUE!"}},{"$f":"((H35+I35)/B33)*100","v":{"$error":"#VALUE!"}},{"$f":"IF(B33=0,0, $B$34*$L$34)","v":{"$error":"#VALUE!"}},{"$f":"IF(B3=\"\",0, IF(B3<>\"\", (B34*M29),0))","v":0},{"$f":"B35+B36","v":0},{"$f":"IF(B33=0,0, L35+M35+N35)","v":{"$error":"#VALUE!"}},{"$f":"IF(B33=0,0, ROUND(((N35+M35)/O35)*100,1))","v":{"$error":"#VALUE!"}}]
["GGBFS",{"$f":"IF(B$7=\"\",0,ROUND((B$7/100)*(B$33),0))","v":0},{"$f":"IF(C$7=\"\",0,ROUND((C$7/100)*(C$33),0))","v":0},{"$f":"IF(D$7=\"\",0,ROUND((D$7/100)*(D$33),0))","v":0},{"$f":"IF(E$7=\"\",0,ROUND((E$7/100)*(E$33),0))","v":0},{"$f":"IF(F$7=\"\",0,ROUND((F$7/100)*(F$33),0))","v":0}]
["Water Wt.",{"$f":"IF(B34=\"\",\"\",IF('Mix Info'!B25>0,'Mix Info'!B25*B33,IF( 'Mix Info'!B26<>\"\",0.4*(O35),(VLOOKUP(B2,$B$44:$F$100,5,FALSE)*(O35)))))","v":""},{"$f":"IF(C34=\"\",\"\",IF('Mix Info'!C25>0,'Mix Info'!C25*C33,IF( 'Mix Info'!C26<>\"\",0.4*(C33),(VLOOKUP(C2,$B$44:$F$100,5,FALSE)*(C33)))))","v":""},{"$f":"IF(D34=\"\",\"\",IF('Mix Info'!D25>0,'Mix Info'!D25*D33,IF('Mix Info'!D26<>\"\",0.4*(D33),(VLOOKUP(D2,$B$44:$F$100,5,FALSE)*(D33)))))","v":""},{"$f":"IF(E34=\"\",\"\",IF('Mix Info'!E25>0,'Mix Info'!E25*E33,IF( 'Mix Info'!E26<>\"\",0.4*(E33),(VLOOKUP(E2,$B$44:$F$100,5,FALSE)*(E33)))))","v":""},{"$f":"IF(F34=\"\",\"\",IF('Mix Info'!F25>0,'Mix Info'!F25*F33,IF( 'Mix Info'!F26<>\"\",0.4*(F33),(VLOOKUP(F2,$B$44:$F$100,5,FALSE)*(F33)))))","v":""}]
["Fine Dry Wt.",{"$f":"IF(B9=\"\",0,IF(B25=0,\"\",ROUND((B29*B9*$G$2),0)))","v":0},{"$f":"IF(C25=\"\",\"\",ROUND((C29*C9*$G$2),0))","v":""},{"$f":"IF(D25=\"\",\"\",ROUND((D29*D9*$G$2),0))","v":""},{"$f":"IF(E25=\"\",\"\",ROUND((E29*E9*$G$2),0))","v":""},{"$f":"IF(F25=\"\",\"\",ROUND((F29*F9*$G$2),0))","v":""}]
["Interm. Dry Wt.",{"$f":"IF(B10=\"\",0,IF(B26=0,\"\",IF(B26=\"\",\"\",ROUND((B30*B10*$G$2),0))))","v":0},{"$f":"IF(C26=0,\"\",IF(C26=\"\",\"\",ROUND((C30*C10*$G$2),0)))","v":""},{"$f":"IF(D26=0,\"\",IF(D26=\"\",\"\",ROUND((D30*D10*$G$2),0)))","v":""},{"$f":"IF(E26=0,\"\",IF(E26=\"\",\"\",ROUND((E30*E10*$G$2),0)))","v":""},{"$f":"IF(F26=0,\"\",IF(F26=\"\",\"\",ROUND((F30*F10*$G$2),0)))","v":""}]
["Ca Dry Wt.",{"$f":"IF(B11=\"\",0,IF(B27=0,\"\",ROUND((B31*B11*$G$2),0)))","v":0},{"$f":"IF(C27=\"\",\"\",ROUND((C31*C11*$G$2),0))","v":""},{"$f":"IF(D27=\"\",\"\",ROUND((D31*D11*$G$2),0))","v":""},{"$f":"IF(E27=\"\",\"\",ROUND((E31*E11*$G$2),0))","v":""},{"$f":"IF(F27=\"\",\"\",ROUND((F31*F11*$G$2),0))","v":""}]
[null,{"$f":"IF(B2=\"\",\"\",(VLOOKUP('Mix Info'!B2,$B$44:$G$100,6,FALSE)))","v":""}]
[null,null,"Abs.","% Fine","% Coarse","Bas H2O","Max. H2O","% Intermediate"]
[null,1,2,3,4,5,6,7]
["A-2","A-2",0.10100000000000001,40,60,0.47400000000000003,0.53200000000000003,0]
["A-3","A-3",0.10400000000000001,45,55,0.47400000000000003,0.53200000000000003,0]
["A-4","A-4",0.108,50,50,0.47400000000000003,0.53200000000000003,0]
["A-5","A-5",0.111,55,45,0.47400000000000003,0.53200000000000003,0]
["A-6","A-6",0.115,60,40,0.47400000000000003,0.53200000000000003,0]
["A-V","A-V",0.13500000000000001,95,5,0.44400000000000001,0.46700000000000003,0]
["A-V47B","A-V47B",0.107,70,30,0.44,0.56000000000000005,0]
["B-2","B-2",8.7999999999999995E-2,40,60,0.53600000000000003,0.6,0]
["B-3","B-3",9.0999999999999998E-2,45,55,0.53600000000000003,0.6,0]
["B-4","B-4",9.2999999999999999E-2,50,50,0.53600000000000003,0.6,0]
["B-5","B-5",9.6000000000000002E-2,55,45,0.53600000000000003,0.6,0]
["B-6","B-6",9.9000000000000005E-2,60,40,0.53600000000000003,0.6,0]
["B-7","B-7",0.10200000000000001,65,35,0.53600000000000003,0.6,0]
["B-8","B-8",0.105,70,30,0.53600000000000003,0.6,0]
["BR","BR",0.114,{"$f":"'Mix Info'!$H$7","v":0},{"$f":"'Mix Info'!$H$5","v":0},0.4,0.45,{"$f":"'Mix Info'!$H$6","v":0}]
["B-V","B-V",0.13500000000000001,95,5,0.44400000000000001,0.46700000000000003,0]
["B-V47B","B-V47B",9.8000000000000004E-2,70,30,0.52,0.59699999999999998,0]
["C-2","C-2",0.11,40,60,0.43,0.48799999999999999,0]
["C-3","C-3",0.114,45,55,0.43,0.48799999999999999,0]
["C-3WR","C-3WR",0.108,45,55,0.43,0.45,0]
["C-4","C-4",0.11800000000000001,50,50,0.43,0.48799999999999999,0]
["C-4WR","C-4WR",0.112,50,50,0.43,0.45,0]
["C-5","C-5",0.123,55,45,0.43,0.48799999999999999,0]
["C-5WR","C-5WR",0.11700000000000001,55,45,0.43,0.45,0]
["C-6","C-6",0.128,60,40,0.43,0.48799999999999999,0]
["C-6WR","C-6WR",0.121,60,40,0.43,0.45,0]
["CDM","CDM",{"$f":"IF('Mix Info'!$N$5=\"\",0,'Mix Info'!$N$5)","v":0.1086},{"$f":"'Mix Info'!$H$7","v":0},{"$f":"'Mix Info'!$H$5","v":0},{"$f":"'Mix Info'!$N$6","v":0.4},{"$f":"'Mix Info'!$N$7","v":0.42},{"$f":"'Mix Info'!$H$6","v":0}]
["C-SUD","C-SUD",0.106,{"$f":"'Mix Info'!$H$7","v":0},{"$f":"'Mix Info'!$H$5","v":0},0.4,0.42,{"$f":"'Mix Info'!$H$6","v":0}]
["C-SUDCW","C-SUDCW",0.11799999999999999,{"$f":"'Mix Info'!$H$7","v":0},{"$f":"'Mix Info'!$H$5","v":0},0.4,0.42,{"$f":"'Mix Info'!$H$6","v":0}]
["C-V","C-V",0.13500000000000001,95,5,0.44400000000000001,0.46700000000000003,0]
["C-V47BP","C-V47BP",0.113,70,30,0.43,0.48799999999999999,0]
["C-V47BS","C-V47BS",0.113,70,30,0.43,0.48799999999999999,0]
["CV-HPC-D","CV-HPC-D",0.123,55,45,0.4,0.435,0]
["CV-HPC-S","CV-HPC-S",0.123,55,45,0.42,0.45,0]
["CV-SUD","CV-SUD",0.114,55,45,0.4,0.42,0]
["D-57","D-57",0.13400000000000001,50,50,0.42299999999999999,0.45,0]
["D-57-6","D-57-6",0.13400000000000001,60,40,0.42299999999999999,0.45,0]
["FM-Non Cr. Fl.","FM-Non Cr. Fl.",null,null,null,null,null,0]
["FM-Cr. Fl.","FM-Cr. Fl.",null,null,null,null,null,0]
["GR","GR",null,null,null,null,null,0]
["HPC-D","HPC-D",0.11799999999999999,{"$f":"'Mix Info'!$H$7","v":0},{"$f":"'Mix Info'!$H$5","v":0},0.4,0.435,{"$f":"'Mix Info'!$H$6","v":0}]
["HPC-O","HPC-O",0.13400000000000001,50,50,0.39,0.42,0]
["HPC-S","HPC-S",0.11799999999999999,50,50,0.42,0.45,0]
["MCM","MCM",0.106,45,55,0.4,0.45,0]
["M-3","M-3",0.14899999999999999,45,55,0.32800000000000001,0.4,0]
["M-4","M-4",0.156,50,50,0.32800000000000001,0.4,0]
["M-5","M-5",0.16,55,45,0.32800000000000001,0.4,0]
["M-V","M-V",0.16,95,5,0.39,0.42,0]
["M-V47B","M-V47B",0.155,55,45,0.35,0.4,0]
["O-4WR","O-4WR",0.156,50,50,0.32700000000000001,0,0]
["QMC","QMC",0.10589999999999999,{"$f":"'Mix Info'!$H$7","v":0},{"$f":"'Mix Info'!$H$5","v":0},0.4,0.435,{"$f":"'Mix Info'!$H$6","v":0}]
["QMPEM","QMPEM",{"$f":"IF('Mix Info'!$N$5=\"\",0,'Mix Info'!$N$5)","v":0.1086},{"$f":"'Mix Info'!$H$7","v":0},{"$f":"'Mix Info'!$H$5","v":0},{"$f":"'Mix Info'!$N$6","v":0.4},0.435,{"$f":"'Mix Info'!$H$6","v":0}]
["SCC","SCC",{"$f":"IF('Mix Info'!$N$5=\"\",0,'Mix Info'!$N$5)","v":0.1086},{"$f":"'Mix Info'!$H$7","v":0},{"$f":"'Mix Info'!$H$5","v":0},{"$f":"'Mix Info'!$N$6","v":0.4},{"$f":"'Mix Info'!$N$7","v":0.42},{"$f":"'Mix Info'!$H$6","v":0}]
["TBR","TBR",0.1153,50,50,0.4,0.45,0]
["X-2","X-2",0.124,60,40,0.42299999999999999," ",0]
["X-3","X-3",0.129,55,45,0.42299999999999999," ",0]
["X-4","X-4",0.13400000000000001,50,50,0.42299999999999999," ",0]

{"sheet":"Grad 1","index":6,"n_rows":54,"n_cols":23,"rows_kept":54,"cut":false,"hidden":false,"merged":[[0,3,0,9],[12,3,12,5],[14,4,14,9],[6,2,6,4],[48,3,50,5],[3,2,4,2],[21,2,22,2],[40,2,41,2],[18,3,18,8],[9,3,9,5],[24,2,24,4],[37,3,37,8],[43,2,43,4]]}
["Proj. No.:",{"$f":"IF('Proj Info'!B8=\"\",\"\",'Proj Info'!B8)","v":""},null,null,null,null,null,null,null,null,null,null,null,null,null,null,null,null,null,{"$f":"'Proj Info'!B43","v":0}]
["Sample ID: ",null,null,null,null,null,"COARSE   SAMPLE",null,null,null,null,null,null,null,null,null,null,null,null,null,{"$f":"IF(AND(T1=2, B4<1500), \"N\", IF(AND(T1=3, B4<3500),\"N\", IF(AND(T1=4,B4<5000),\"N\", IF(AND(T1=5, B4<2000),\"N\", IF(AND(T1=6,B4<1500),\"N\", \"Y\")))))","v":"Y"}]
["Sample Date:  ",null,null,null,null,null,null,null,null,null,null,null,null,null,null,null,null,null,null,null,null,null,{"$f":"IF(B4=\"\",\"\", IF(I11>=95, 200, IF('Grad 1'!I10>=95, 500, IF('Grad 1'!I9>=95, 1000, IF('Grad 1'!I8>=95, 1500, IF('Grad 1'!I7>=95, 2000, IF('Grad 1'!I6>=95, 3500, IF('Grad 1'!I5>=95, 5000, \"\"))))))))","v":""}]
["Orig. Dry Weight:",null,{"$f":"IF('Mix Info'!K4=\"ENTER\",\"\",IF(AND(T1=2, B4>0, B4< 1500), \"IM 301 min. 1500g\",IF(AND(T1=3, B4<3500, B4>0), \"IM 301 min. 3500g\", IF(AND(T1=4, B4>0, B4<5000), \"IM 301 min. 5000g\", IF(AND(T1=5, B4>0, B4< 2000), \"IM 301 min. 2000g\", IF(AND(T1=6, B4>0, B4<1500), \"IM 301 min. 1500g\", IF(AND(T1=0, B4>0),\"Enter Grad # on Proj Info tab\", \"\")))))))","v":""},"   Sieve Accuracy= ",{"$f":"ROUND(IF(D12=\"\",0,SUM(D12/B4)*100),1)","v":0},"%","% Retd.","% Pass","% Final","Specs",null,null,"% Retd.",1,2,3,4,5,null,12,{"$f":"IF(AND(D6=12,OR(T1=3,T1=4,T1=5),OR(B10>850,B11>450,B12>450)), \"N\",\"Y\")","v":"Y"},null,{"$f":"IF(B4=\"\",\"\", IF(B4<W3, \"N\", \"Y\"))","v":""}]
["1.5\" (37.5mm) Sieve   ",null,null,{"$f":"IF(E4<5,\"\",IF(E4<99.5,\"Check Weights.\",IF(E4>100.5,\"Check Weights\",\"\")))","v":""},null,null,{"$f":"IF($M$14=100,$M5,IF($N$14=100,$N5,IF($O$14=100,$O5,IF($P$14=100,$P5,IF($Q$14=100,$Q5,IF($R$14=100,$R5,$R5))))))","v":0.1},{"$f":"IF(D12=\"\",0,100)","v":0},{"$f":"IF(H5>9.9,ROUND(H5,0),ROUND(H5,1))","v":0},{"$f":"IF('Proj Info'!B90=\"\",\"\",'Proj Info'!B90)","v":""},{"$f":"LARGE(M5:M12,1)","v":0},{"$f":"IF(M14<100,(K5+0.1),IF(M14>100,(K5-0.1),K5))","v":0.1},{"$f":"ROUND(IF(B5=\"\",0,SUM(B5/$B$4)*100),1)","v":0},{"$f":"IF(M5=$K$5,$L$5,M5)","v":0.1},{"$f":"IF(N5=K$6,L$6,N5)","v":0.1},{"$f":"IF(O5=K$7,L$7,O5)","v":0.1},{"$f":"IF(P5=K$8,L$8,P5)","v":0.1},{"$f":"IF(Q5=K$9,L$9,Q5)","v":0.1},null,"Box",{"$f":"IF(AND(T1=3, OR(I6<95,I8<25,I8>60,I10>10,I11>5)),\"N\",\"Y\")","v":"Y"}]
["1\" (25mm) Sieve   ",null,"Sieve Type=","12 Combined",null,null,0.1,{"$f":"IF(H5=\"\",0,(H5-G6))","v":0},0,{"$f":"IF('Proj Info'!B91=\" \",\" \",'Proj Info'!B91)","v":""},{"$f":"LARGE(M5:M12,2)","v":0},{"$f":"IF(N14>100,K6-0.1,IF(N14<100,K6+0.1,K6))","v":0.1},0,0.1,0.1,0.1,0.1,0.1,null,"12 Combined",{"$f":"IF('Proj Info'!B43=2,\"Y\",IF(AND(OR(T1=3,T1=4,T1=5,T1=6),'Proj Info'!E43=1.5,'Grad 1'!I14>1.5),\"N\", IF(AND('Proj Info'!E43=2.5,'Grad 1'!I14>2.5),\"N\", IF(J14=\"\", \"N\",\"Y\"))))","v":"Y"}]
["3/4\" (19mm) Sieve   ",null,{"$f":"IF(AND(D6=\"\",B4>0), \"Please select a sieve size\", \"\")","v":""},null,null,null,0.1,0,0,{"$f":"IF('Proj Info'!B92=\" \",\" \",'Proj Info'!B92)","v":""},{"$f":"LARGE(M5:M12,3)","v":0},{"$f":"IF(O14>100,K7-0.1,IF(O14<100,K7+0.1,K7))","v":0.1},0,0.1,0.1,0.1,0.1,0.1,null,null,{"$f":"IF(AND(T1=4,OR(I6<50,I7<30,I8<20,I8>75,I9<5,I9>55,I10>10,I11>5)),\"N\",\"Y\")","v":"Y"}]
["1/2\" (12.5mm) Sieve   ",null,null,null,null,null,0.1,0,{"$f":"IF(H8>9.9,ROUND(H8,0),ROUND(H8,1))","v":0},{"$f":"IF('Proj Info'!B93=\" \",\" \",'Proj Info'!B93)","v":""},{"$f":"LARGE(M5:M12,4)","v":0},{"$f":"IF(P14>100,K8-0.1,IF(P14<100,K8+0.1,K8))","v":0.1},0,0.1,0.1,0.1,0.1,0.1,null,null,{"$f":"IF(AND(T1=5,OR(I6<100,I7<90,I9<20,I9>55,I10>10,I11>5)),\"N\",\"Y\")","v":"Y"}]
["3/8\" (9.5mm) Sieve   ",null,null,null,null,null,0.1,0,0,{"$f":"IF('Proj Info'!B94=\" \",\" \",'Proj Info'!B94)","v":""},{"$f":"LARGE(M5:M12,5)","v":0},{"$f":"IF(Q14>100,K9-0.1,IF(Q14<100,K9+0.1,K9))","v":0.1},0,0.1,0.1,0.1,0.1,0.1,null,null,{"$f":"IF(AND(T1=2, OR(I8<95,I11>10)),\"N\",\"Y\")","v":"Y"}]
["#4 (4.75mm) Sieve   ",null,{"$f":"IF(AND(D6=12,B10>850),\"IM302 #4 >850g\",\" \")","v":" "},null,null,null,0.1,0,0,{"$f":"IF('Proj Info'!B95=\" \",\" \",'Proj Info'!B95)","v":""},null,null,0,0.1,0.1,0.1,0.1,0.1,null,null,{"$f":"IF(AND(T1=6,OR(I7<100,I8<90,I9<40,I9>90,I10>30)),\"N\",\"Y\")","v":"Y"}]
["#8 (2.36mm) Sieve   ",null,{"$f":"IF(AND(D6=12,B11>450),\"IM302 #8 >450g\",\" \")","v":" "},"Total",null,null,0.1,0,0,{"$f":"IF('Proj Info'!B96=\" \",\" \",'Proj Info'!B96)","v":""},null,null,0,0.1,0.1,0.1,0.1,0.1,null,null,{"$f":"IF(AND(B4>0, D6=\"\"), \"N\",\"Y\")","v":"Y"}]
["  Pan   ",null,null,{"$f":"IF(B12=\"\",0,SUM(B5:B12))","v":0},null,null,0.1,null,null,null,null,null,0,0.1,0.1,0.1,0.1,0.1]
["Orig. Dry Weight:",null,"W",null,null,null,{"$f":"SUM(G5:G12)","v":0.79999999999999993},null,null,null,null,null,0,0.1,0.1,0.1,0.1,0.1]
["Dry Wt. Washed:",null,"A",null,null,null,null,"#200",{"$f":"ROUND(IF(B17=\"\",0,SUM(B17/B13)*100),1)","v":0},{"$f":"IF('Proj Info'!B97=\"\",\"\",'Proj Info'!B97)","v":"0-2.5"},null,null,{"$f":"ROUND(IF(M12=\"\",0,SUM(M5:M12)),1)","v":0},0.8,0.8,0.8,0.8,0.8]
["  Pan   ",null,"S",null,{"$f":"IF('Proj Info'!B43=2,\"\", IF(AND(B4>0, J14=\"\"), \"Please enter the max % passing the #200 sieve on the Project Info tab\",\"\"))","v":""}]
["  Wash Loss   ",{"$f":"IF(B14=\"\",0,SUM(B13-B14))","v":0},"H",null,null,null,null,null,{"$f":"IF(AND(F5>0, N15=\"\"), \"Please enter the max % passing the #200 sieve on the Project Info tab\",\"\")","v":""}]
["  Total   ",{"$f":"IF(B15=\"\",0,SUM(B15:B16))","v":0},null,null,null,null,null,null,{"$f":"IF(AND(F6>0, N16=\"\"), \"Please enter the max % passing the #200 sieve on the Project Info tab\",\"\")","v":""}]
["Complies (Y/N)",{"$f":"IF(AND(U2=\"N\",B4>0), \"N\", IF(AND(U4=\"N\",B4>0),\"N\",IF(AND(U5=\"N\",B4>0),\"N\",IF(AND(U6=\"N\",B4>0),\"N\",IF(AND(U7=\"N\",B4>0),\"N\",IF(AND(U8=\"N\",B4>0),\"N\",IF(AND(U9=\"N\",B4>0),\"N\",IF(AND(U10=\"N\",B4>0),\"N\", IF(AND(U11=\"N\",B4>0),\"N\", IF(AND(B4>0,OR(B13=\"\",B14=\"\",B15=\"\")),\"N\",\"Y\"))))))))))","v":"Y"},null,null,null,null,null,null,{"$f":"IF(AND(F7>0, N17=\"\"), \"Please enter the max % passing the #200 sieve on the Project Info tab\",\"\")","v":""}]
[null,null,null,null,null,null,null,null,null,null,null,null,null,null,null,null,null,null,null,{"$f":"'Proj Info'!B45","v":0}]
["Sample ID: ",null,null,null,null,null,"INTERMEDIATE   SAMPLE",null,null,null,null,null,null,null,null,null,null,null,null,{"$f":"IF(AND(T19=2,B22<1500), \"N\", IF(AND(T19=2,OR(I26<95, I29>10)), \"N\",\"Y\"))","v":"Y"}]
["Sample Date:  ",null,null,null,null,null,null,null,null,null,null,null,null,null,null,null,null,null,null,{"$f":"IF(AND(T19=6,B22<1500), \"N\", IF(AND(T19=6,B22>0, OR(I25<100, I26<90, I27<40, I27>90, I28>30, I32>'Proj Info'!E43)), \"N\",\"Y\"))","v":"Y"}]
["Orig. Dry Weight:",null,{"$f":"IF('Mix Info'!K4=\"ENTER\",\"\",IF(AND(OR(T19=2,T19=6),B22>0,B22<1500),\"IM 301 min. 1500g\",IF(AND(T19=0,B22>0),\"Enter Grad # on Proj Info tab\",\"\")))","v":""},"   Sieve Accuracy= ",{"$f":"ROUND(IF(D30=\"\",0,SUM(D30/B22)*100),1)","v":0},"%","% Retd.","% Pass","% Final","Specs",null,null,"% Retd.",1,2,3,4,5,null,{"$f":"IF(AND(B22>0, D24=\"\"), \"N\",\"Y\")","v":"Y"},null,null,{"$f":"IF(B22=\"\",\"\", IF(I29>=95, 200, IF('Grad 1'!I28>=95, 500, IF('Grad 1'!I27>=95, 1000, IF('Grad 1'!I26>=95, 1500, IF('Grad 1'!I25>=95, 2000, IF('Grad 1'!I24>=95, 3500, IF('Grad 1'!I23>=95, 5000, \"\"))))))))","v":""}]
["1.5\" (37.5mm) Sieve   ",null,null,{"$f":"IF(E22<5,\"\",IF(E22<99.5,\"Check Weights.\",IF(E22>100.5,\"Check Weights\",\"\")))","v":""},null,null,{"$f":"IF($M$23=100,$M23,IF($N$23=100,$N23,IF($O$23=100,$O23,IF($P$23=100,$P23,IF($Q$23=100,$Q23,IF($R$23=100,$R23,$R23))))))","v":0.1},{"$f":"IF(D30=\"\",0,100)","v":0},{"$f":"IF(H23>9.9,ROUND(H23,0),ROUND(H23,1))","v":0},null,{"$f":"LARGE(M23:M30,1)","v":0},{"$f":"IF(M32<100,(K23+0.1),IF(M32>100,(K23-0.1),K23))","v":0.1},{"$f":"ROUND(IF(B23=\"\",0,SUM(B23/$B$22)*100),1)","v":0},{"$f":"IF(M23=$K$23,$L$23,M23)","v":0.1},{"$f":"IF(N23=K$24,L$24,N23)","v":0.1},{"$f":"IF(O23=K$25,L$25,O23)","v":0.1},{"$f":"IF(P23=K$26,L$26,P23)","v":0.1},{"$f":"IF(Q23=K$27,L$27,Q23)","v":0.1},null,null,null,null,{"$f":"IF(B22=\"\",\"\", IF(B22<W22, \"N\", \"Y\"))","v":""}]
["1\" (25mm) Sieve   ",null,"Sieve Type=",null,null,null,{"$f":"IF($M$24=100,$M24,IF($N$24=100,$N24,IF($O$24=100,$O24,IF($P$24=100,$P24,IF($Q$24=100,$Q24,IF($R$24=100,$R24,$R24))))))","v":0.1},{"$f":"IF(H23=\"\",0,(H23-G24))","v":0},0,null,{"$f":"LARGE(M23:M30,2)","v":0},{"$f":"IF(N32>100,K24-0.1,IF(N32<100,K24+0.1,K24))","v":0.1},{"$f":"ROUND(IF(B24=\"\",0,SUM(B24/$B$22)*100),1)","v":0},{"$f":"IF(M24=$K$23,$L$23,M24)","v":0.1},{"$f":"IF(N24=K$24,L$24,N24)","v":0.1},{"$f":"IF(O24=K$25,L$25,O24)","v":0.1},{"$f":"IF(P24=K$26,L$26,P24)","v":0.1},{"$f":"IF(Q24=K$27,L$27,Q24)","v":0.1}]
["3/4\" (19mm) Sieve   ",null,{"$f":"IF(AND(D24=\"\", B22>0), \"Please select a sieve size\",\"\")","v":""},null,null,null,{"$f":"IF($M$14=100,$M25,IF($N$14=100,$N25,IF($O$14=100,$O25,IF($P$14=100,$P25,IF($Q$14=100,$Q25,IF($R$14=100,$R25,$R25))))))","v":0.1},0,0,{"$f":"IF('Proj Info'!B98=\"\",\"\",'Proj Info'!B98)","v":""},{"$f":"LARGE(M23:M30,3)","v":0},{"$f":"IF(O32>100,K25-0.1,IF(O32<100,K25+0.1,K25))","v":0.1},0,0.1,0.1,0.1,0.1,0.1]
["1/2\" (12.5mm) Sieve   ",null,null,null,null,null,0.1,0,0,{"$f":"IF('Proj Info'!B99=\" \",\" \",'Proj Info'!B99)","v":""},{"$f":"LARGE(M23:M30,4)","v":0},{"$f":"IF(P32>100,K26-0.1,IF(P32<100,K26+0.1,K26))","v":0.1},0,0.1,0.1,0.1,0.1,0.1]
["3/8\" (9.5mm) Sieve   ",null,null,null,null,null,0.1,0,0,{"$f":"IF('Proj Info'!B100=\"\",\"\",'Proj Info'!B100)","v":""},{"$f":"LARGE(M23:M30,5)","v":0},{"$f":"IF(Q32>100,K27-0.1,IF(Q32<100,K27+0.1,K27))","v":0.1},0,0.1,0.1,0.1,0.1,0.1]
["#4 (4.75mm) Sieve   ",null,null,null,null,null,0.1,0,0,{"$f":"IF('Proj Info'!B101=\"\",\"\",'Proj Info'!B101)","v":""},null,null,0,0.1,0.1,0.1,0.1,0.1]
["#8 (2.36mm) Sieve   ",null,null,"Total",null,null,0.1,0,0,{"$f":"IF('Proj Info'!B102=\" \",\" \",'Proj Info'!B102)","v":""},null,null,0,0.1,0.1,0.1,0.1,0.1]
["  Pan   ",null,null,{"$f":"IF(B30=\"\",0,SUM(B23:B30))","v":0},null,null,0.1,null,null,null,null,null,0,0.1,0.1,0.1,0.1,0.1]
["Orig. Dry Weight:",null,"W",null,null,null,{"$f":"SUM(G23:G30)","v":0.79999999999999993}]
["Dry Wt. Washed:",null,"A",null,null,null,null,"#200",{"$f":"ROUND(IF(B35=\"\",0,SUM(B35/B31)*100),1)","v":0},{"$f":"IF('Proj Info'!B103=\"\",\"\",'Proj Info'!B103)","v":""},null,null,{"$f":"ROUND(IF(M30=\"\",0,SUM(M23:M30)),1)","v":0},0.8,0.8,0.8,0.8,0.8]
["  Pan   ",null,"S"]
["  Wash Loss   ",{"$f":"IF(B32=\"\",0,SUM(B31-B32))","v":0},"H"]
["  Total   ",{"$f":"IF(B33=\"\",0,SUM(B33:B34))","v":0}]
["Complies (Y/N)",{"$f":"IF(AND(T20=\"N\",B22>0),\"N\", IF(AND(T22=\"N\",B22>0),\"N\",IF(AND(T21=\"N\",B22>0),\"N\", IF(AND(B22>0,OR(B31=\"\",B32=\"\",B33=\"\")),\"N\",\"Y\"))))","v":"Y"}]
[]
[]
["Sample ID:  "]
["Sample Date:  "]
["Orig. Dry Weight: ",null,{"$f":"IF('Mix Info'!K4=\"ENTER\",\"\",IF(AND(T42=1,B41>0,B41<500),\"IM 301 min. 500g\",IF(AND(T42=7,B41>0,B41<500),\"IM 301 min. 500g\", IF(AND(T42=0, B41>0),\"Enter Grad # on Proj Info tab\",\"\"))))","v":""},"Sieve Accuracy= ",{"$f":"ROUND(IF(D53=\"\",0,SUM(D53/B41)*100),1)","v":0},"%","FINE  SAMPLE",null,null,null,null,null,null,null,null,null,null,null,null,{"$f":"IF(AND( D43=8,OR(T42=1, T42=7), OR(B41<500,B43>200,B44>200,B45>200,B46>200,B47>200,B48>200,B49>200,B50>200,B51>200,B52>200)),\"N\",IF(AND(OR(T42=1,T42=7),OR(B41<500,G43>40.4,G44>40.4,G45>40.4,G46>40.4,G47>40.4,G48>40.4,G49>40.4,G50>40.4,G51>40.4)), \"N\",IF(AND(T42=1, OR(B41<500,I43<100,I44<100,I45<90,I46<70,I48<10,I48>60,I51>1.5)), \"N\", IF(AND(T42=7, OR(B41<500,I45>92,I45<80,I46>75,I46<60,I48>40,I48<20)),\"N\",\"Y\"))))","v":"Y"},null,null,{"$f":"IF(B41=\"\",\"\", IF(I47>=95, 200, IF(I46>=95, 500, \"\")))","v":""}]
["Dry Wt. Washed: ",null,null,{"$f":"IF(E41<5,\"\",IF(E41<99.5,\"Check Weights.\",IF(E41>100.5,\"Check Weights\",\"\")))","v":""},null,null,"% Retd.","% Pass","% Final","Specs",null,null,"% Retd.",null,null,null,null,null,null,{"$f":"'Proj Info'!B47","v":0},null,null,{"$f":"IF(B41=\"\",\"\", IF(B41<W41, \"N\", \"Y\"))","v":""}]
["1/2\" (12.5mm) Sieve   ",null,"Sieve Type=",null,null,null,{"$f":"IF($M$54=100,$M43,IF($N$54=100,$N43,IF($O$54=100,$O43,IF($P$54=100,$P43,IF($Q$54=100,$Q43,IF($R$54=100,$R43,$R43))))))","v":0.1},{"$f":"IF(D53=\"\",0,100-G43)","v":0},{"$f":"IF(H43>9.9,ROUND(H43,0),ROUND(H43,1))","v":0},null,null,null,{"$f":"ROUND(IF(B43=\"\",0,SUM(B43/$B$41)*100),1)","v":0},{"$f":"IF(M43=K44,L44,M43)","v":0},{"$f":"IF(N43=K$46,L$46,N43)","v":0.1},{"$f":"IF(O43=K$47,L$47,O43)","v":0.1},{"$f":"IF(P43=K$48,L$48,P43)","v":0.1},{"$f":"IF(Q43=K$48,L$48,Q43)","v":0.1}]
["3/8\" (9.5mm) Sieve   ",null,{"$f":"IF(AND(D43=\"\", B41>0), \"Please select a sieve size\",\"\")","v":""},null,null,null,0.1,{"$f":"IF(H43=\"\",0,(H43-G44))","v":0},0,{"$f":"IF('Proj Info'!B104=\" \",\" \",'Proj Info'!B104)","v":""},null,null,{"$f":"ROUND(IF(B44=\"\",0,SUM(B44/$B$41)*100),1)","v":0},{"$f":"IF(M44=K45,L45,M44)","v":0.1},{"$f":"IF(N44=K$46,L$46,N44)","v":0.1},{"$f":"IF(O44=K$47,L$47,O44)","v":0.1},{"$f":"IF(P44=K$48,L$48,P44)","v":0.1},{"$f":"IF(Q44=K$48,L$48,Q44)","v":0.1},null,null,8]
["#4 (4.75mm) Sieve   ",null,null,null,null,null,0.1,0,0,{"$f":"IF('Proj Info'!B105=\" \",\" \",'Proj Info'!B105)","v":""},{"$f":"LARGE(M45:M49,1)","v":0},{"$f":"IF(M54<100,(K45+0.1),IF(M54>100,(K45-0.1),K45))","v":0.1},{"$f":"ROUND(IF(B45=\"\",0,SUM(B45/$B$41)*100),1)","v":0},{"$f":"IF(M45=$K$45,$L$45,M45)","v":0.1},{"$f":"IF(N45=K$46,L$46,N45)","v":0.1},{"$f":"IF(O45=K$47,L$47,O45)","v":0.1},{"$f":"IF(P45=K$48,L$48,P45)","v":0.1},{"$f":"IF(Q45=K$49,L$49,Q45)","v":0.1},null,null,12]
["#8 (2.36mm) Sieve   ",null,{"$f":"IF(AND(D43=8, OR(B44>200,B45>200,B46>200,B47>200,B48>200,B49>200,B50>200,B51>200,B52>200)), \"IM 302 >200g retained\",\"\")","v":""},null,null,null,0.1,0,0,{"$f":"IF('Proj Info'!B106=\" \",\" \",'Proj Info'!B106)","v":""},{"$f":"LARGE(M45:M49,2)","v":0},{"$f":"IF(N54<100,(K46+0.1),IF(N54>100,(K46-0.1),K46))","v":0.1},{"$f":"ROUND(IF(B46=\"\",0,SUM(B46/$B$41)*100),1)","v":0},{"$f":"IF(M46=$K$45,$L$45,M46)","v":0.1},{"$f":"IF(N46=K$46,L$46,N46)","v":0.1},{"$f":"IF(O46=K$47,L$47,O46)","v":0.1},{"$f":"IF(P46=K$48,L$48,P46)","v":0.1},{"$f":"IF(Q46=K$49,L$49,Q46)","v":0.1},null,{"$f":"IF(AND(B41>0,D43=\"\"),\"N\",\"Y\")","v":"Y"},"8 Combined"]
["#16 (1.18mm) Sieve   ",null,null,null,null,null,0.1,0,0,null,{"$f":"LARGE(M45:M49,3)","v":0},{"$f":"IF(O54>100,K47-0.1,IF(O54<100,K47+0.1,K47))","v":0.1},0,0.1,0.1,0.1,0.1,0.1,null,{"$f":"IF('Report '!C18=\">10 Cubic Yards Batched, Gradation Required\",\"N\",\"Y\")","v":"Y"}]
["#30 (600 µm) Sieve   ",null,null,null,null,null,0.1,0,0,{"$f":"IF('Proj Info'!B107=\" \",\" \",'Proj Info'!B107)","v":""},{"$f":"LARGE(M45:M49,4)","v":0},{"$f":"IF(P54>100,K48-0.1,IF(P54<100,K48+0.1,K48))","v":0.1},0,0.1,0.1,0.1,0.1,0.1]
["#50 (300 µm)  Sieve   ",null,null,{"$f":"IF(AND(T42=1, OR(G43>40.4,G44>40.4,G45>40.4,G46>40.4,G47>40.4,G48>40.4,G49>40.4,G50>40.4,G51>40.4)), \"Gradation Table, Note 1- No more than 40% shall pass one sieve and be retained on the sieve with the next higher number\",\"\")","v":""},null,null,0.1,0,0,null,{"$f":"LARGE(M45:M49,5)","v":0},{"$f":"IF(Q54>100,K49-0.1,IF(Q54<100,K49+0.1,K49))","v":0.1},0,0.1,0.1,0.1,0.1,0.1]
["#100 (150 µm) Sieve   ",null,null,null,null,null,0.1,0,0,null,null,null,0,0.1,0.1,0.1,0.1,0.1]
["#200 (75 µm) Sieve   ",null,null,null,null,null,0.1,0,{"$f":"IF(H51>9.9,ROUND(H51,0),ROUND(H51,10))","v":0},{"$f":"IF('Proj Info'!B108=\" \",\" \",'Proj Info'!B108)","v":""},null,null,0,0.1,0.1,0.1,0.1,0.1]
["   Pan  ",null,null,"Total",null,null,{"$f":"IF($M$54=100,$M52,IF($N$54=100,$N52,IF($O$54=100,$O52,IF($P$54=100,$P52,IF($Q$54=100,$Q52,IF($R$54=100,$R52,$R52))))))","v":0.1},null,null,null,null,null,{"$f":"ROUND(IF(B52=\"\",0,SUM((B52+B53)/$B$41)*100),1)","v":0},0.1,0.1,0.1,0.1,0.1]
["   Wash  ",{"$f":"IF(B42=\"\",0,SUM(B41-B42))","v":0},null,{"$f":"IF(B52=\"\",0,SUM(B43:B53))","v":0},null,null,{"$f":"IF(G52=\"\",0,SUM(G43:G52))","v":0.99999999999999989},"FM:",{"$f":"IF(B41=\"\",\"\",(800-(SUM(H44:H50)+H43))/100)","v":""}]
["Compies (Y/N)",{"$f":"IF(AND(T41=\"N\",B41>0),\"N\",IF(AND(T46=\"N\",B41>0),\"N\",IF(T47=\"N\",\"N\",\"Y\")))","v":"Y"},null,null,null,null,null,null,null,null,null,null,{"$f":"ROUND(IF(M52>=0,SUM(M43:M52)),1)","v":0},0.9,1,1,1,1]

{"sheet":"Grad 2","index":7,"n_rows":54,"n_cols":23,"rows_kept":54,"cut":false,"hidden":false,"merged":[[24,2,24,4],[40,2,41,2],[48,3,50,5],[43,2,43,4],[3,2,4,2],[14,4,14,9],[21,2,22,2],[6,2,6,4]]}
["Proj. No.:",{"$f":"IF('Proj Info'!B8=\"\",\"\",'Proj Info'!B8)","v":""},null,null,null,null,null,null,null,null,null,null,null,null,null,null,null,null,null,{"$f":"'Proj Info'!B43","v":0}]
["Sample ID: ",null,null,null,null,null,"COARSE   SAMPLE",null,null,null,null,null,null,null,null,null,null,null,null,null,{"$f":"IF(AND(T1=2, B4<1500), \"N\", IF(AND(T1=3, B4<3500),\"N\", IF(AND(T1=4,B4<5000),\"N\", IF(AND(T1=5, B4<2000),\"N\", IF(AND(T1=6,B4<1500),\"N\", \"Y\")))))","v":"Y"}]
["Sample Date:  ",null,null,null,null,null,null,null,null,null,null,null,null,null,null,null,null,null,null,null,null,null,{"$f":"IF(B4=\"\",\"\", IF(I11>=95, 200, IF('Grad 1'!I10>=95, 500, IF('Grad 1'!I9>=95, 1000, IF('Grad 1'!I8>=95, 1500, IF('Grad 1'!I7>=95, 2000, IF('Grad 1'!I6>=95, 3500, IF('Grad 1'!I5>=95, 5000, \"\"))))))))","v":""}]
["Orig. Dry Weight:",null,{"$f":"IF('Mix Info'!K4=\"ENTER\",\"\",IF(AND(T1=2, B4>0, B4< 1500), \"IM 301 min. 1500g\",IF(AND(T1=3, B4<3500, B4>0), \"IM 301 min. 3500g\", IF(AND(T1=4, B4>0, B4<5000), \"IM 301 min. 5000g\", IF(AND(T1=5, B4>0, B4< 2000), \"IM 301 min. 2000g\", IF(AND(T1=6, B4>0, B4<1500), \"IM 301 min. 1500g\", IF(AND(T1=0, B4>0),\"Enter Grad # on Proj Info tab\", \"\")))))))","v":""},"   Sieve Accuracy= ",{"$f":"ROUND(IF(D12=\"\",0,SUM(D12/B4)*100),1)","v":0},"%","% Retd.","% Pass","% Final","Specs",null,null,"% Retd.",1,2,3,4,5,null,12,{"$f":"IF(AND(D6=12,OR(T1=3,T1=4,T1=5),OR(B10>850,B11>450,B12>450)), \"N\",\"Y\")","v":"Y"},null,{"$f":"IF(B4=\"\",\"\", IF(B4<W3, \"N\", \"Y\"))","v":""}]
["1.5\" (37.5mm) Sieve   ",null,null,{"$f":"IF(E4<5,\"\",IF(E4<99.5,\"Check Weights.\",IF(E4>100.5,\"Check Weights\",\"\")))","v":""},null,null,{"$f":"IF($M$14=100,$M5,IF($N$14=100,$N5,IF($O$14=100,$O5,IF($P$14=100,$P5,IF($Q$14=100,$Q5,IF($R$14=100,$R5,$R5))))))","v":0.1},{"$f":"IF(D12=\"\",0,100)","v":0},{"$f":"IF(H5>9.9,ROUND(H5,0),ROUND(H5,1))","v":0},{"$f":"IF('Proj Info'!B90=\" \",\" \",'Proj Info'!B90)","v":""},{"$f":"LARGE(M5:M12,1)","v":0},{"$f":"IF(M14<100,(K5+0.1),IF(M14>100,(K5-0.1),K5))","v":0.1},{"$f":"ROUND(IF(B5=\"\",0,SUM(B5/$B$4)*100),1)","v":0},{"$f":"IF(M5=$K$5,$L$5,M5)","v":0.1},{"$f":"IF(N5=K$6,L$6,N5)","v":0.1},{"$f":"IF(O5=K$7,L$7,O5)","v":0.1},{"$f":"IF(P5=K$8,L$8,P5)","v":0.1},{"$f":"IF(Q5=K$9,L$9,Q5)","v":0.1},null,"Box",{"$f":"IF(AND(T1=3, OR(I6<95,I8<25,I8>60,I10>10,I11>5)),\"N\",\"Y\")","v":"Y"}]
["1\" (25mm) Sieve   ",null,"Sieve Type=",null,null,null,0.1,{"$f":"IF(H5=\"\",0,(H5-G6))","v":0},{"$f":"IF(H6>9.9,ROUND(H6,0),ROUND(H6,1))","v":0},{"$f":"IF('Proj Info'!B91=\" \",\" \",'Proj Info'!B91)","v":""},{"$f":"LARGE(M5:M12,2)","v":0},{"$f":"IF(N14>100,K6-0.1,IF(N14<100,K6+0.1,K6))","v":0.1},0,0.1,0.1,0.1,0.1,0.1,null,"12 Combined",{"$f":"IF('Proj Info'!B43=2,\"Y\",IF(AND(OR(T1=3,T1=4,T1=5,T1=6),'Proj Info'!E43=1.5,'Grad 2'!I14>1.5),\"N\", IF(AND('Proj Info'!E43=2.5,'Grad 2'!I14>2.5),\"N\", IF(J14=\"\", \"N\",\"Y\"))))","v":"Y"}]
["3/4\" (19mm) Sieve   ",null,{"$f":"IF(AND(D6=\"\",B4>0), \"Please select a sieve size\", \"\")","v":""},null,null,null,0.1,0,0,{"$f":"IF('Proj Info'!B92=\" \",\" \",'Proj Info'!B92)","v":""},{"$f":"LARGE(M5:M12,3)","v":0},{"$f":"IF(O14>100,K7-0.1,IF(O14<100,K7+0.1,K7))","v":0.1},0,0.1,0.1,0.1,0.1,0.1,null,null,{"$f":"IF(AND(T1=4,OR(I6<50,I7<30,I8<20,I8>75,I9<5,I9>55,I10>10,I11>5)),\"N\",\"Y\")","v":"Y"}]
["1/2\" (12.5mm) Sieve   ",null,null,null,null,null,0.1,0,{"$f":"IF(H8>9.9,ROUND(H8,0),ROUND(H8,1))","v":0},{"$f":"IF('Proj Info'!B93=\" \",\" \",'Proj Info'!B93)","v":""},{"$f":"LARGE(M5:M12,4)","v":0},{"$f":"IF(P14>100,K8-0.1,IF(P14<100,K8+0.1,K8))","v":0.1},0,0.1,0.1,0.1,0.1,0.1,null,null,{"$f":"IF(AND(T1=5,OR(I6<100,I7<90,I9<20,I9>55,I10>10,I11>5)),\"N\",\"Y\")","v":"Y"}]
["3/8\" (9.5mm) Sieve   ",null,null,null,null,null,0.1,0,0,{"$f":"IF('Proj Info'!B94=\" \",\" \",'Proj Info'!B94)","v":""},{"$f":"LARGE(M5:M12,5)","v":0},{"$f":"IF(Q14>100,K9-0.1,IF(Q14<100,K9+0.1,K9))","v":0.1},0,0.1,0.1,0.1,0.1,0.1,null,null,{"$f":"IF(AND(T1=2, OR(I8<95,I11>10)),\"N\",\"Y\")","v":"Y"}]
["#4 (4.75mm) Sieve   ",null,{"$f":"IF(AND(D6=12,B10>850),\"IM302 #4 >850g\",\" \")","v":" "},null,null,null,0.1,0,0,{"$f":"IF('Proj Info'!B95=\" \",\" \",'Proj Info'!B95)","v":""},null,null,0,0.1,0.1,0.1,0.1,0.1,null,null,{"$f":"IF(AND(T1=6,OR(I7<100,I8<90,I9<40,I9>90,I10>30)),\"N\",\"Y\")","v":"Y"}]
["#8 (2.36mm) Sieve   ",null,{"$f":"IF(AND(D6=12,B11>450),\"IM302 #8 >450g\",\" \")","v":" "},"Total",null,null,0.1,0,0,{"$f":"IF('Proj Info'!B96=\" \",\" \",'Proj Info'!B96)","v":""},null,null,0,0.1,0.1,0.1,0.1,0.1,null,null,{"$f":"IF(AND(B4>0, D6=\"\"), \"N\",\"Y\")","v":"Y"}]
["  Pan   ",null,null,{"$f":"IF(B12=\"\",0,SUM(B5:B12))","v":0},null,null,0.1,null,null,null,null,null,0,0.1,0.1,0.1,0.1,0.1]
["Orig. Dry Weight:",null,"W",null,null,null,{"$f":"SUM(G5:G12)","v":0.79999999999999993}]
["Dry Wt. Washed:",null,"A",null,null,null,null,"#200",{"$f":"ROUND(IF(B17=\"\",0,SUM(B17/B13)*100),1)","v":0},{"$f":"IF('Proj Info'!B97=\" \",\" \",'Proj Info'!B97)","v":"0-2.5"},null,null,{"$f":"ROUND(IF(M12=\"\",0,SUM(M5:M12)),1)","v":0},0.8,0.8,0.8,0.8,0.8]
["  Pan   ",null,"S",null,{"$f":"IF('Proj Info'!B43=2,\"\",IF(AND(B4>0, J14=\"\"), \"Please enter the max % passing the #200 sieve on the Project Info tab\",\"\"))","v":""}]
["  Wash Loss   ",{"$f":"IF(B14=\"\",0,SUM(B13-B14))","v":0},"H"]
["  Total   ",{"$f":"IF(B15=\"\",0,SUM(B15:B16))","v":0}]
["Complies (Y/N)",{"$f":"IF(AND(U2=\"N\",B4>0), \"N\", IF(AND(U4=\"N\",B4>0),\"N\",IF(AND(U5=\"N\",B4>0),\"N\",IF(AND(U6=\"N\",B4>0),\"N\",IF(AND(U7=\"N\",B4>0),\"N\",IF(AND(U8=\"N\",B4>0),\"N\",IF(AND(U9=\"N\",B4>0),\"N\",IF(AND(U10=\"N\",B4>0),\"N\", IF(AND(U11=\"N\",B4>0),\"N\", IF(AND(B4>0,OR(B13=\"\",B14=\"\",B15=\"\")),\"N\",\"Y\"))))))))))","v":"Y"}]
[null,null,null,null,null,null,null,null,null,null,null,null,null,null,null,null,null,null,null,{"$f":"'Proj Info'!B45","v":0}]
["Sample ID: ",null,null,null,null,null,"INTERMEDIATE   SAMPLE",null,null,null,null,null,null,null,null,null,null,null,null,{"$f":"IF(AND(T19=2,B22<1500), \"N\", IF(AND(T19=2,OR(I26<95, I29>10)), \"N\",\"Y\"))","v":"Y"}]
["Sample Date:  ",null,null,null,null,null,null,null,null,null,null,null,null,null,null,null,null,null,null,{"$f":"IF(AND(T19=6,B22<1500), \"N\", IF(AND(T19=6,B22>0, OR(I25<100, I26<90, I27<40, I27>90, I28>30, I32>'Proj Info'!E43)), \"N\",\"Y\"))","v":"Y"}]
["Orig. Dry Weight:",null,{"$f":"IF('Mix Info'!K4=\"ENTER\",\"\",IF(AND(OR(T19=2,T19=6),B22>0,B22<1500),\"IM 301 min. 1500g\",IF(AND(T19=0,B22>0),\"Enter Grad # on Proj Info tab\",\"\")))","v":""},"   Sieve Accuracy= ",{"$f":"ROUND(IF(D30=\"\",0,SUM(D30/B22)*100),1)","v":0},"%","% Retd.","% Pass","% Final","Specs",null,null,"% Retd.",1,2,3,4,5,null,{"$f":"IF(AND(B22>0, D24=\"\"), \"N\",\"Y\")","v":"Y"},null,null,{"$f":"IF(B22=\"\",\"\", IF(I29>=95, 200, IF('Grad 1'!I28>=95, 500, IF('Grad 1'!I27>=95, 1000, IF('Grad 1'!I26>=95, 1500, IF('Grad 1'!I25>=95, 2000, IF('Grad 1'!I24>=95, 3500, IF('Grad 1'!I23>=95, 5000, \"\"))))))))","v":""}]
["1.5\" (37.5mm) Sieve   ",null,null,{"$f":"IF(E22<5,\"\",IF(E22<99.5,\"Check Weights.\",IF(E22>100.5,\"Check Weights\",\"\")))","v":""},null,null,{"$f":"IF($M$23=100,$M23,IF($N$23=100,$N23,IF($O$23=100,$O23,IF($P$23=100,$P23,IF($Q$23=100,$Q23,IF($R$23=100,$R23,$R23))))))","v":0.1},{"$f":"IF(D30=\"\",0,100)","v":0},{"$f":"IF(H23>9.9,ROUND(H23,0),ROUND(H23,1))","v":0},null,{"$f":"LARGE(M23:M30,1)","v":0},{"$f":"IF(M32<100,(K23+0.1),IF(M32>100,(K23-0.1),K23))","v":0.1},{"$f":"ROUND(IF(B23=\"\",0,SUM(B23/$B$22)*100),1)","v":0},{"$f":"IF(M23=$K$23,$L$23,M23)","v":0.1},{"$f":"IF(N23=K$24,L$24,N23)","v":0.1},{"$f":"IF(O23=K$25,L$25,O23)","v":0.1},{"$f":"IF(P23=K$26,L$26,P23)","v":0.1},{"$f":"IF(Q23=K$27,L$27,Q23)","v":0.1},null,null,null,null,{"$f":"IF(B22=\"\",\"\", IF(B22<W22, \"N\", \"Y\"))","v":""}]
["1\" (25mm) Sieve   ",null,"Sieve Type=",null,null,null,{"$f":"IF($M$24=100,$M24,IF($N$24=100,$N24,IF($O$24=100,$O24,IF($P$24=100,$P24,IF($Q$24=100,$Q24,IF($R$24=100,$R24,$R24))))))","v":0.1},{"$f":"IF(H23=\"\",0,(H23-G24))","v":0},0,null,{"$f":"LARGE(M23:M30,2)","v":0},{"$f":"IF(N32>100,K24-0.1,IF(N32<100,K24+0.1,K24))","v":0.1},{"$f":"ROUND(IF(B24=\"\",0,SUM(B24/$B$22)*100),1)","v":0},{"$f":"IF(M24=$K$23,$L$23,M24)","v":0.1},{"$f":"IF(N24=K$24,L$24,N24)","v":0.1},{"$f":"IF(O24=K$25,L$25,O24)","v":0.1},{"$f":"IF(P24=K$26,L$26,P24)","v":0.1},{"$f":"IF(Q24=K$27,L$27,Q24)","v":0.1},null,null,null,null,""]
["3/4\" (19mm) Sieve   ",null,{"$f":"IF(AND(D24=\"\", B22>0), \"Please select a sieve size\",\"\")","v":""},null,null,null,{"$f":"IF($M$14=100,$M25,IF($N$14=100,$N25,IF($O$14=100,$O25,IF($P$14=100,$P25,IF($Q$14=100,$Q25,IF($R$14=100,$R25,$R25))))))","v":0.1},0,0,{"$f":"IF('Proj Info'!B98=\"\",\"\",'Proj Info'!B98)","v":""},{"$f":"LARGE(M23:M30,3)","v":0},{"$f":"IF(O32>100,K25-0.1,IF(O32<100,K25+0.1,K25))","v":0.1},0,0.1,0.1,0.1,0.1,0.1,null,null,null,null,""]
["1/2\" (12.5mm) Sieve   ",null,null,null,null,null,0.1,0,0,{"$f":"IF('Proj Info'!B99=\" \",\" \",'Proj Info'!B99)","v":""},{"$f":"LARGE(M23:M30,4)","v":0},{"$f":"IF(P32>100,K26-0.1,IF(P32<100,K26+0.1,K26))","v":0.1},0,0.1,0.1,0.1,0.1,0.1]
["3/8\" (9.5mm) Sieve   ",null,null,null,null,null,0.1,0,0,{"$f":"IF('Proj Info'!B100=\"\",\"\",'Proj Info'!B100)","v":""},{"$f":"LARGE(M23:M30,5)","v":0},{"$f":"IF(Q32>100,K27-0.1,IF(Q32<100,K27+0.1,K27))","v":0.1},0,0.1,0.1,0.1,0.1,0.1]
["#4 (4.75mm) Sieve   ",null,null,null,null,null,0.1,0,0,{"$f":"IF('Proj Info'!B101=\"\",\"\",'Proj Info'!B101)","v":""},null,null,0,0.1,0.1,0.1,0.1,0.1]
["#8 (2.36mm) Sieve   ",null,null,"Total",null,null,0.1,0,0,{"$f":"IF('Proj Info'!B102=\" \",\" \",'Proj Info'!B102)","v":""},null,null,0,0.1,0.1,0.1,0.1,0.1]
["  Pan   ",null,null,{"$f":"IF(B30=\"\",0,SUM(B23:B30))","v":0},null,null,0.1,null,null,null,null,null,0,0.1,0.1,0.1,0.1,0.1]
["Orig. Dry Weight:",null,"W",null,null,null,{"$f":"SUM(G23:G30)","v":0.79999999999999993}]
["Dry Wt. Washed:",null,"A",null,null,null,null,"#200",{"$f":"ROUND(IF(B35=\"\",0,SUM(B35/B31)*100),1)","v":0},{"$f":"IF('Proj Info'!B103=\"\",\"\",'Proj Info'!B103)","v":""},null,null,{"$f":"ROUND(IF(M30=\"\",0,SUM(M23:M30)),1)","v":0},0.8,0.8,0.8,0.8,0.8]
["  Pan   ",null,"S"]
["  Wash Loss   ",{"$f":"IF(B32=\"\",0,SUM(B31-B32))","v":0},"H"]
["  Total   ",{"$f":"IF(B33=\"\",0,SUM(B33:B34))","v":0}]
["Complies (Y/N)",{"$f":"IF(AND(T20=\"N\",B22>0),\"N\", IF(AND(T22=\"N\",B22>0),\"N\",IF(AND(T21=\"N\",B22>0),\"N\", IF(AND(B22>0,OR(B31=\"\",B32=\"\",B33=\"\")),\"N\",\"Y\"))))","v":"Y"}]
[]
[]
["Sample ID:  "]
["Sample Date:  "]
["Orig. Dry Weight: ",null,{"$f":"IF('Mix Info'!K4=\"ENTER\",\"\",IF(AND(T42=1,B41>0,B41<500),\"IM 301 min. 500g\",IF(AND(T42=7,B41>0,B41<500),\"IM 301 min. 500g\", IF(AND(T42=0, B41>0),\"Enter Grad # on Proj Info tab\",\"\"))))","v":""},"Sieve Accuracy= ",{"$f":"ROUND(IF(D53=\"\",0,SUM(D53/B41)*100),1)","v":0},"%","FINE  SAMPLE",null,null,null,null,null,null,null,null,null,null,null,null,{"$f":"IF(AND( D43=8,OR(T42=1, T42=7), OR(B41<500,B43>200,B44>200,B45>200,B46>200,B47>200,B48>200,B49>200,B50>200,B51>200,B52>200)),\"N\",IF(AND(OR(T42=1,T42=7),OR(B41<500,G43>40.4,G44>40.4,G45>40.4,G46>40.4,G47>40.4,G48>40.4,G49>40.4,G50>40.4,G51>40.4)), \"N\",IF(AND(T42=1, OR(B41<500,I43<100,I44<100,I45<90,I46<70,I48<10,I48>60,I51>1.5)), \"N\", IF(AND(T42=7, OR(B41<500,I45>92,I45<80,I46>75,I46<60,I48>40,I48<20)),\"N\",\"Y\"))))","v":"Y"},null,null,{"$f":"IF(B41=\"\",\"\", IF(I47>=95, 200, IF(I46>=95, 500, \"\")))","v":""}]
["Dry Wt. Washed: ",null,null,{"$f":"IF(E41<5,\"\",IF(E41<99.5,\"Check Weights.\",IF(E41>100.5,\"Check Weights\",\"\")))","v":""},null,null,"% Retd.","% Pass","% Final","Specs",null,null,"% Retd.",null,null,null,null,null,null,{"$f":"'Proj Info'!B47","v":0},null,null,{"$f":"IF(B41=\"\",\"\", IF(B41<W41, \"N\", \"Y\"))","v":""}]
["1/2\" (12.5mm) Sieve   ",null,"Sieve Type=",null,null,null,{"$f":"IF($M$54=100,$M43,IF($N$54=100,$N43,IF($O$54=100,$O43,IF($P$54=100,$P43,IF($Q$54=100,$Q43,IF($R$54=100,$R43,$R43))))))","v":0.1},{"$f":"IF(D53=\"\",0,100-G43)","v":0},{"$f":"IF(H43>9.9,ROUND(H43,0),ROUND(H43,1))","v":0},null,null,null,{"$f":"ROUND(IF(B43=\"\",0,SUM(B43/$B$41)*100),1)","v":0},{"$f":"IF(M43=K44,L44,M43)","v":0},{"$f":"IF(N43=K$46,L$46,N43)","v":0.1},{"$f":"IF(O43=K$47,L$47,O43)","v":0.1},{"$f":"IF(P43=K$48,L$48,P43)","v":0.1},{"$f":"IF(Q43=K$48,L$48,Q43)","v":0.1}]
["3/8\" (9.5mm) Sieve   ",null,{"$f":"IF(AND(D43=\"\", B41>0), \"Please select a sieve size\",\"\")","v":""},null,null,null,0.1,{"$f":"IF(H43=\"\",0,(H43-G44))","v":0},0,{"$f":"IF('Proj Info'!B104=\" \",\" \",'Proj Info'!B104)","v":""},null,null,{"$f":"ROUND(IF(B44=\"\",0,SUM(B44/$B$41)*100),1)","v":0},{"$f":"IF(M44=K45,L45,M44)","v":0.1},{"$f":"IF(N44=K$46,L$46,N44)","v":0.1},{"$f":"IF(O44=K$47,L$47,O44)","v":0.1},{"$f":"IF(P44=K$48,L$48,P44)","v":0.1},{"$f":"IF(Q44=K$48,L$48,Q44)","v":0.1},null,null,8]
["#4 (4.75mm) Sieve   ",null,null,null,null,null,0.1,{"$f":"IF(H44=\"\",0,(H44-G45))","v":0},0,{"$f":"IF('Proj Info'!B105=\" \",\" \",'Proj Info'!B105)","v":""},{"$f":"LARGE(M45:M49,1)","v":0},{"$f":"IF(M54<100,(K45+0.1),IF(M54>100,(K45-0.1),K45))","v":0.1},0,{"$f":"IF(M45=$K$45,$L$45,M45)","v":0.1},0.1,0.1,0.1,{"$f":"IF(Q45=K$49,L$49,Q45)","v":0.1},null,null,12]
["#8 (2.36mm) Sieve   ",null,{"$f":"IF(AND(D43=8, OR(B44>200,B45>200,B46>200,B47>200,B48>200,B49>200,B50>200,B51>200,B52>200)), \"IM 302 >200g retained\",\"\")","v":""},null,null,null,0.1,0,0,{"$f":"IF('Proj Info'!B106=\" \",\" \",'Proj Info'!B106)","v":""},{"$f":"LARGE(M45:M49,2)","v":0},{"$f":"IF(N54<100,(K46+0.1),IF(N54>100,(K46-0.1),K46))","v":0.1},0,0.1,0.1,0.1,0.1,0.1,null,{"$f":"IF(AND(B41>0,D43=\"\"),\"N\",\"Y\")","v":"Y"},"8 Combined"]
["#16 (1.18mm) Sieve   ",null,null,null,null,null,0.1,0,0,null,{"$f":"LARGE(M45:M49,3)","v":0},{"$f":"IF(O54>100,K47-0.1,IF(O54<100,K47+0.1,K47))","v":0.1},0,0.1,0.1,0.1,0.1,0.1]
["#30 (600 µm) Sieve   ",null,null,null,null,null,0.1,0,0,{"$f":"IF('Proj Info'!B107=\" \",\" \",'Proj Info'!B107)","v":""},{"$f":"LARGE(M45:M49,4)","v":0},{"$f":"IF(P54>100,K48-0.1,IF(P54<100,K48+0.1,K48))","v":0.1},0,0.1,0.1,0.1,0.1,0.1]
["#50 (300 µm)  Sieve   ",null,null,{"$f":"IF(AND(T42=1, OR(G43>40.4,G44>40.4,G45>40.4,G46>40.4,G47>40.4,G48>40.4,G49>40.4,G50>40.4,G51>40.4)), \"Gradation Table, Note 1- No more than 40% shall pass one sieve and be retained on the sieve with the next higher number\",\"\")","v":""},null,null,0.1,0,0,null,{"$f":"LARGE(M45:M49,5)","v":0},{"$f":"IF(Q54>100,K49-0.1,IF(Q54<100,K49+0.1,K49))","v":0.1},0,0.1,0.1,0.1,0.1,0.1]
["#100 (150 µm) Sieve   ",null,null,null,null,null,0.1,0,0,null,null,null,0,0.1,0.1,0.1,0.1,0.1]
["#200 (75 µm) Sieve   ",null,null,null,null,null,0.1,{"$f":"IF(H50=\"\",0,(H50-G51))","v":0},{"$f":"IF(H51>9.9,ROUND(H51,0),ROUND(H51,10))","v":0},{"$f":"IF('Proj Info'!B108=\" \",\" \",'Proj Info'!B108)","v":""},null,null,0,0.1,0.1,0.1,0.1,0.1]
["   Pan  ",null,null,"Total",null,null,{"$f":"IF($M$54=100,$M52,IF($N$54=100,$N52,IF($O$54=100,$O52,IF($P$54=100,$P52,IF($Q$54=100,$Q52,IF($R$54=100,$R52,$R52))))))","v":0.1},null,null,null,null,null,{"$f":"ROUND(IF(B52=\"\",0,SUM((B52+B53)/$B$41)*100),1)","v":0},0.1,0.1,0.1,0.1,0.1]
["   Wash  ",{"$f":"IF(B42=\"\",0,SUM(B41-B42))","v":0},null,{"$f":"IF(B52=\"\",0,SUM(B43:B53))","v":0},null,null,{"$f":"IF(G52=\"\",0,SUM(G43:G52))","v":0.99999999999999989},"FM:",{"$f":"IF(B41=\"\",\"\",(800-(SUM(H44:H50)+H43))/100)","v":""}]
["Complies (Y/N)",{"$f":"IF(AND(T41=\"N\",B41>0),\"N\",IF(AND(T46=\"N\",B41>0),\"N\",\"Y\"))","v":"Y"},null,null,null,null,null,null,null,null,null,null,{"$f":"ROUND(IF(M52>=0,SUM(M43:M52)),1)","v":0},{"$f":"ROUND(IF(N52>=0,SUM(N43:N52)),1)","v":0.9},{"$f":"ROUND(IF(O52>=0,SUM(O43:O52)),1)","v":1},{"$f":"ROUND(IF(P52>=0,SUM(P43:P52)),1)","v":1},{"$f":"ROUND(IF(Q52>=0,SUM(Q43:Q52)),1)","v":1},{"$f":"ROUND(IF(R52=\"\",0,SUM(R43:R52)),1)","v":1}]

{"sheet":"Grad 3","index":8,"n_rows":54,"n_cols":23,"rows_kept":54,"cut":false,"hidden":false,"merged":[[3,2,4,2],[21,2,22,2],[48,3,50,5],[6,2,6,4],[14,4,14,9],[24,2,24,4],[40,2,41,2],[43,2,43,4]]}
["Proj. No.:",{"$f":"IF('Proj Info'!B8=\"\",\"\",'Proj Info'!B8)","v":""},null,null,null,null,null,null,null,null,null,null,null,null,null,null,null,null,null,{"$f":"'Proj Info'!B43","v":0}]
["Sample ID: ",null,null,null,null,null,"COARSE   SAMPLE",null,null,null,null,null,null,null,null,null,null,null,null,null,{"$f":"IF(AND(T1=2, B4<1500), \"N\", IF(AND(T1=3, B4<3500),\"N\", IF(AND(T1=4,B4<5000),\"N\", IF(AND(T1=5, B4<2000),\"N\", IF(AND(T1=6,B4<1500),\"N\", \"Y\")))))","v":"Y"}]
["Sample Date:  ",null,null,null,null,null,null,null,null,null,null,null,null,null,null,null,null,null,null,null,null,null,{"$f":"IF(B4=\"\",\"\", IF(I11>=95, 200, IF('Grad 1'!I10>=95, 500, IF('Grad 1'!I9>=95, 1000, IF('Grad 1'!I8>=95, 1500, IF('Grad 1'!I7>=95, 2000, IF('Grad 1'!I6>=95, 3500, IF('Grad 1'!I5>=95, 5000, \"\"))))))))","v":""}]
["Orig. Dry Weight:",null,{"$f":"IF('Mix Info'!K4=\"ENTER\",\"\",IF(AND(T1=2, B4>0, B4< 1500), \"IM 301 min. 1500g\",IF(AND(T1=3, B4<3500, B4>0), \"IM 301 min. 3500g\", IF(AND(T1=4, B4>0, B4<5000), \"IM 301 min. 5000g\", IF(AND(T1=5, B4>0, B4< 2000), \"IM 301 min. 2000g\", IF(AND(T1=6, B4>0, B4<1500), \"IM 301 min. 1500g\", IF(AND(T1=0, B4>0),\"Enter Grad # on Proj Info tab\", \"\")))))))","v":""},"   Sieve Accuracy= ",{"$f":"ROUND(IF(D12=\"\",0,SUM(D12/B4)*100),1)","v":0},"%","% Retd.","% Pass","% Final","Specs",null,null,"% Retd.",1,2,3,4,5,null,12,{"$f":"IF(AND(D6=12,OR(T1=3,T1=4,T1=5),OR(B10>850,B11>450,B12>450)), \"N\",\"Y\")","v":"Y"},null,{"$f":"IF(B4=\"\",\"\", IF(B4<W3, \"N\", \"Y\"))","v":""}]
["1.5\" (37.5mm) Sieve   ",null,null,{"$f":"IF(E4<5,\"\",IF(E4<99.5,\"Check Weights.\",IF(E4>100.5,\"Check Weights\",\"\")))","v":""},null,null,{"$f":"IF($M$14=100,$M5,IF($N$14=100,$N5,IF($O$14=100,$O5,IF($P$14=100,$P5,IF($Q$14=100,$Q5,IF($R$14=100,$R5,$R5))))))","v":0.1},{"$f":"IF(D12=\"\",0,100)","v":0},{"$f":"IF(H5>9.9,ROUND(H5,0),ROUND(H5,1))","v":0},{"$f":"IF('Proj Info'!B90=\" \",\" \",'Proj Info'!B90)","v":""},{"$f":"LARGE(M5:M12,1)","v":0},{"$f":"IF(M14<100,(K5+0.1),IF(M14>100,(K5-0.1),K5))","v":0.1},{"$f":"ROUND(IF(B5=\"\",0,SUM(B5/$B$4)*100),1)","v":0},{"$f":"IF(M5=$K$5,$L$5,M5)","v":0.1},{"$f":"IF(N5=K$6,L$6,N5)","v":0.1},{"$f":"IF(O5=K$7,L$7,O5)","v":0.1},{"$f":"IF(P5=K$8,L$8,P5)","v":0.1},{"$f":"IF(Q5=K$9,L$9,Q5)","v":0.1},null,"Box",{"$f":"IF(AND(T1=3, OR(I6<95,I8<25,I8>60,I10>10,I11>5)),\"N\",\"Y\")","v":"Y"}]
["1\" (25mm) Sieve   ",null,"Sieve Type=",null,null,null,0.1,{"$f":"IF(H5=\"\",0,(H5-G6))","v":0},0,{"$f":"IF('Proj Info'!B91=\" \",\" \",'Proj Info'!B91)","v":""},{"$f":"LARGE(M5:M12,2)","v":0},{"$f":"IF(N14>100,K6-0.1,IF(N14<100,K6+0.1,K6))","v":0.1},0,0.1,0.1,0.1,0.1,0.1,null,"12 Combined",{"$f":"IF('Proj Info'!B43=2,\"Y\",IF(AND(OR(T1=3,T1=4,T1=5,T1=6),'Proj Info'!E43=1.5,'Grad 3'!I14>1.5),\"N\", IF(AND('Proj Info'!E43=2.5,'Grad 3'!I14>2.5),\"N\", IF(J14=\"\", \"N\",\"Y\"))))","v":"Y"}]
["3/4\" (19mm) Sieve   ",null,{"$f":"IF(AND(D6=\"\",B4>0), \"Please select a sieve size\", \"\")","v":""},null,null,null,0.1,0,0,{"$f":"IF('Proj Info'!B92=\" \",\" \",'Proj Info'!B92)","v":""},{"$f":"LARGE(M5:M12,3)","v":0},{"$f":"IF(O14>100,K7-0.1,IF(O14<100,K7+0.1,K7))","v":0.1},0,0.1,0.1,0.1,0.1,0.1,null,null,{"$f":"IF(AND(T1=4,OR(I6<50,I7<30,I8<20,I8>75,I9<5,I9>55,I10>10,I11>5)),\"N\",\"Y\")","v":"Y"}]
["1/2\" (12.5mm) Sieve   ",null,null,null,null,null,0.1,0,{"$f":"IF(H8>9.9,ROUND(H8,0),ROUND(H8,1))","v":0},{"$f":"IF('Proj Info'!B93=\" \",\" \",'Proj Info'!B93)","v":""},{"$f":"LARGE(M5:M12,4)","v":0},{"$f":"IF(P14>100,K8-0.1,IF(P14<100,K8+0.1,K8))","v":0.1},0,0.1,0.1,0.1,0.1,0.1,null,null,{"$f":"IF(AND(T1=5,OR(I6<100,I7<90,I9<20,I9>55,I10>10,I11>5)),\"N\",\"Y\")","v":"Y"}]
["3/8\" (9.5mm) Sieve   ",null,null,null,null,null,0.1,0,0,{"$f":"IF('Proj Info'!B94=\" \",\" \",'Proj Info'!B94)","v":""},{"$f":"LARGE(M5:M12,5)","v":0},{"$f":"IF(Q14>100,K9-0.1,IF(Q14<100,K9+0.1,K9))","v":0.1},0,0.1,0.1,0.1,0.1,0.1,null,null,{"$f":"IF(AND(T1=2, OR(I8<95,I11>10)),\"N\",\"Y\")","v":"Y"}]
["#4 (4.75mm) Sieve   ",null,{"$f":"IF(AND(D6=12,B10>850),\"IM302 #4 >850g\",\" \")","v":" "},null,null,null,0.1,0,0,{"$f":"IF('Proj Info'!B95=\" \",\" \",'Proj Info'!B95)","v":""},null,null,0,0.1,0.1,0.1,0.1,0.1,null,null,{"$f":"IF(AND(T1=6,OR(I7<100,I8<90,I9<40,I9>90,I10>30)),\"N\",\"Y\")","v":"Y"}]
["#8 (2.36mm) Sieve   ",null,{"$f":"IF(AND(D6=12,B11>450),\"IM302 #8 >450g\",\" \")","v":" "},"Total",null,null,0.1,0,0,{"$f":"IF('Proj Info'!B96=\" \",\" \",'Proj Info'!B96)","v":""},null,null,0,0.1,0.1,0.1,0.1,0.1,null,null,{"$f":"IF(AND(B4>0, D6=\"\"), \"N\",\"Y\")","v":"Y"}]
["  Pan   ",null,null,{"$f":"IF(B12=\"\",0,SUM(B5:B12))","v":0},null,null,0.1,null,null,null,null,null,0,0.1,0.1,0.1,0.1,0.1]
["Orig. Dry Weight:",null,"W",null,null,null,{"$f":"SUM(G5:G12)","v":0.79999999999999993}]
["Dry Wt. Washed:",null,"A",null,null,null,null,"#200",{"$f":"ROUND(IF(B17=\"\",0,SUM(B17/B13)*100),1)","v":0},{"$f":"IF('Proj Info'!B97=\" \",\" \",'Proj Info'!B97)","v":"0-2.5"},null,null,{"$f":"ROUND(IF(M12=\"\",0,SUM(M5:M12)),1)","v":0},0.8,0.8,0.8,0.8,0.8]
["  Pan   ",null,"S",null,{"$f":"IF('Proj Info'!B43=2,\"\",IF(AND(B4>0, J14=\"\"), \"Please enter the max % passing the #200 sieve on the Project Info tab\",\"\"))","v":""}]
["  Wash Loss   ",{"$f":"IF(B14=\"\",0,SUM(B13-B14))","v":0},"H"]
["  Total   ",{"$f":"IF(B15=\"\",0,SUM(B15:B16))","v":0}]
["Complies (Y/N)",{"$f":"IF(AND(U2=\"N\",B4>0), \"N\", IF(AND(U4=\"N\",B4>0),\"N\",IF(AND(U5=\"N\",B4>0),\"N\",IF(AND(U6=\"N\",B4>0),\"N\",IF(AND(U7=\"N\",B4>0),\"N\",IF(AND(U8=\"N\",B4>0),\"N\",IF(AND(U9=\"N\",B4>0),\"N\",IF(AND(U10=\"N\",B4>0),\"N\", IF(AND(U11=\"N\",B4>0),\"N\", IF(AND(B4>0,OR(B13=\"\",B14=\"\",B15=\"\")),\"N\",\"Y\"))))))))))","v":"Y"}]
[null,null,null,null,null,null,null,null,null,null,null,null,null,null,null,null,null,null,null,{"$f":"'Proj Info'!B45","v":0}]
["Sample ID: ",null,null,null,null,null,"INTERMEDIATE   SAMPLE",null,null,null,null,null,null,null,null,null,null,null,null,{"$f":"IF(AND(T19=2,B22<1500), \"N\", IF(AND(T19=2,OR(I26<95, I29>10)), \"N\",\"Y\"))","v":"Y"}]
["Sample Date:  ",null,null,null,null,null,null,null,null,null,null,null,null,null,null,null,null,null,null,{"$f":"IF(AND(T19=6,B22<1500), \"N\", IF(AND(T19=6,B22>0, OR(I25<100, I26<90, I27<40, I27>90, I28>30, I32>'Proj Info'!E43)), \"N\",\"Y\"))","v":"Y"}]
["Orig. Dry Weight:",null,{"$f":"IF('Mix Info'!K4=\"ENTER\",\"\",IF(AND(OR(T19=2, T19=6),B22>0,B22<1500),\"IM 301 min. 1500g\",IF(AND(T19=0,B22>0),\"Enter Grad # on Proj Info tab\",\"\")))","v":""},"   Sieve Accuracy= ",{"$f":"ROUND(IF(D30=\"\",0,SUM(D30/B22)*100),1)","v":0},"%","% Retd.","% Pass","% Final","Specs",null,null,"% Retd.",1,2,3,4,5,null,{"$f":"IF(AND(B22>0, D24=\"\"), \"N\",\"Y\")","v":"Y"},null,null,{"$f":"IF(B22=\"\",\"\", IF(I29>=95, 200, IF('Grad 1'!I28>=95, 500, IF('Grad 1'!I27>=95, 1000, IF('Grad 1'!I26>=95, 1500, IF('Grad 1'!I25>=95, 2000, IF('Grad 1'!I24>=95, 3500, IF('Grad 1'!I23>=95, 5000, \"\"))))))))","v":""}]
["1.5\" (37.5mm) Sieve   ",null,null,{"$f":"IF(E22<5,\"\",IF(E22<99.5,\"Check Weights.\",IF(E22>100.5,\"Check Weights\",\"\")))","v":""},null,null,{"$f":"IF($M$23=100,$M23,IF($N$23=100,$N23,IF($O$23=100,$O23,IF($P$23=100,$P23,IF($Q$23=100,$Q23,IF($R$23=100,$R23,$R23))))))","v":0.1},{"$f":"IF(D30=\"\",0,100)","v":0},{"$f":"IF(H23>9.9,ROUND(H23,0),ROUND(H23,1))","v":0},null,{"$f":"LARGE(M23:M30,1)","v":0},{"$f":"IF(M32<100,(K23+0.1),IF(M32>100,(K23-0.1),K23))","v":0.1},{"$f":"ROUND(IF(B23=\"\",0,SUM(B23/$B$22)*100),1)","v":0},{"$f":"IF(M23=$K$23,$L$23,M23)","v":0.1},{"$f":"IF(N23=K$24,L$24,N23)","v":0.1},{"$f":"IF(O23=K$25,L$25,O23)","v":0.1},{"$f":"IF(P23=K$26,L$26,P23)","v":0.1},{"$f":"IF(Q23=K$27,L$27,Q23)","v":0.1},null,null,null,null,{"$f":"IF(B22=\"\",\"\", IF(B22<W22, \"N\", \"Y\"))","v":""}]
["1\" (25mm) Sieve   ",null,"Sieve Type=",null,null,null,{"$f":"IF($M$24=100,$M24,IF($N$24=100,$N24,IF($O$24=100,$O24,IF($P$24=100,$P24,IF($Q$24=100,$Q24,IF($R$24=100,$R24,$R24))))))","v":0.1},{"$f":"IF(H23=\"\",0,(H23-G24))","v":0},0,null,{"$f":"LARGE(M23:M30,2)","v":0},{"$f":"IF(N32>100,K24-0.1,IF(N32<100,K24+0.1,K24))","v":0.1},{"$f":"ROUND(IF(B24=\"\",0,SUM(B24/$B$22)*100),1)","v":0},{"$f":"IF(M24=$K$23,$L$23,M24)","v":0.1},{"$f":"IF(N24=K$24,L$24,N24)","v":0.1},{"$f":"IF(O24=K$25,L$25,O24)","v":0.1},{"$f":"IF(P24=K$26,L$26,P24)","v":0.1},{"$f":"IF(Q24=K$27,L$27,Q24)","v":0.1}]
["3/4\" (19mm) Sieve   ",null,{"$f":"IF(AND(D24=\"\", B22>0), \"Please select a sieve size\",\"\")","v":""},null,null,null,{"$f":"IF($M$14=100,$M25,IF($N$14=100,$N25,IF($O$14=100,$O25,IF($P$14=100,$P25,IF($Q$14=100,$Q25,IF($R$14=100,$R25,$R25))))))","v":0.1},0,0,{"$f":"IF('Proj Info'!B98=\"\",\"\",'Proj Info'!B98)","v":""},{"$f":"LARGE(M23:M30,3)","v":0},{"$f":"IF(O32>100,K25-0.1,IF(O32<100,K25+0.1,K25))","v":0.1},0,0.1,0.1,0.1,0.1,0.1]
["1/2\" (12.5mm) Sieve   ",null,null,null,null,null,0.1,0,0,{"$f":"IF('Proj Info'!B99=\" \",\" \",'Proj Info'!B99)","v":""},{"$f":"LARGE(M23:M30,4)","v":0},{"$f":"IF(P32>100,K26-0.1,IF(P32<100,K26+0.1,K26))","v":0.1},0,0.1,0.1,0.1,0.1,0.1]
["3/8\" (9.5mm) Sieve   ",null,null,null,null,null,0.1,0,0,{"$f":"IF('Proj Info'!B100=\"\",\"\",'Proj Info'!B100)","v":""},{"$f":"LARGE(M23:M30,5)","v":0},{"$f":"IF(Q32>100,K27-0.1,IF(Q32<100,K27+0.1,K27))","v":0.1},0,0.1,0.1,0.1,0.1,0.1]
["#4 (4.75mm) Sieve   ",null,null,null,null,null,0.1,0,0,{"$f":"IF('Proj Info'!B101=\"\",\"\",'Proj Info'!B101)","v":""},null,null,0,0.1,0.1,0.1,0.1,0.1]
["#8 (2.36mm) Sieve   ",null,null,"Total",null,null,0.1,0,0,{"$f":"IF('Proj Info'!B102=\" \",\" \",'Proj Info'!B102)","v":""},null,null,0,0.1,0.1,0.1,0.1,0.1]
["  Pan   ",null,null,{"$f":"IF(B30=\"\",0,SUM(B23:B30))","v":0},null,null,0.1,null,null,null,null,null,0,0.1,0.1,0.1,0.1,0.1]
["Orig. Dry Weight:",null,"W",null,null,null,{"$f":"SUM(G23:G30)","v":0.79999999999999993}]
["Dry Wt. Washed:",null,"A",null,null,null,null,"#200",{"$f":"ROUND(IF(B35=\"\",0,SUM(B35/B31)*100),1)","v":0},{"$f":"IF('Proj Info'!B103=\"\",\"\",'Proj Info'!B103)","v":""},null,null,{"$f":"ROUND(IF(M30=\"\",0,SUM(M23:M30)),1)","v":0},0.8,0.8,0.8,0.8,0.8]
["  Pan   ",null,"S"]
["  Wash Loss   ",{"$f":"IF(B32=\"\",0,SUM(B31-B32))","v":0},"H"]
["  Total   ",{"$f":"IF(B33=\"\",0,SUM(B33:B34))","v":0}]
["Complies (Y/N)",{"$f":"IF(AND(T20=\"N\",B22>0),\"N\", IF(AND(T22=\"N\",B22>0),\"N\",IF(AND(T21=\"N\",B22>0),\"N\", IF(AND(B22>0,OR(B31=\"\",B32=\"\",B33=\"\")),\"N\",\"Y\"))))","v":"Y"}]
[]
[]
["Sample ID:  "]
["Sample Date:  "]
["Orig. Dry Weight: ",null,{"$f":"IF('Mix Info'!K4=\"ENTER\",\"\",IF(AND(T42=1,B41>0,B41<500),\"IM 301 min. 500g\",IF(AND(T42=7,B41>0,B41<500),\"IM 301 min. 500g\", IF(AND(T42=0, B41>0),\"Enter Grad # on Proj Info tab\",\"\"))))","v":""},"Sieve Accuracy= ",{"$f":"ROUND(IF(D53=\"\",0,SUM(D53/B41)*100),1)","v":0},"%","FINE  SAMPLE",null,null,null,null,null,null,null,null,null,null,null,null,{"$f":"IF(AND( D43=8,OR(T42=1, T42=7), OR(B41<500,B43>200,B44>200,B45>200,B46>200,B47>200,B48>200,B49>200,B50>200,B51>200,B52>200)),\"N\",IF(AND(OR(T42=1,T42=7),OR(B41<500,G43>40.4,G44>40.4,G45>40.4,G46>40.4,G47>40.4,G48>40.4,G49>40.4,G50>40.4,G51>40.4)), \"N\",IF(AND(T42=1, OR(B41<500,I43<100,I44<100,I45<90,I46<70,I48<10,I48>60,I51>1.5)), \"N\", IF(AND(T42=7, OR(B41<500,I45>92,I45<80,I46>75,I46<60,I48>40,I48<20)),\"N\",\"Y\"))))","v":"Y"},null,null,{"$f":"IF(B41=\"\",\"\", IF(I47>=95, 200, IF(I46>=95, 500, \"\")))","v":""}]
["Dry Wt. Washed: ",null,null,{"$f":"IF(E41<5,\"\",IF(E41<99.5,\"Check Weights.\",IF(E41>100.5,\"Check Weights\",\"\")))","v":""},null,null,"% Retd.","% Pass","% Final","Specs",null,null,"% Retd.",null,null,null,null,null,null,{"$f":"'Proj Info'!B47","v":0},null,null,{"$f":"IF(B41=\"\",\"\", IF(B41<W41, \"N\", \"Y\"))","v":""}]
["1/2\" (12.5mm) Sieve   ",null,"Sieve Type=",null,null,null,{"$f":"IF($M$54=100,$M43,IF($N$54=100,$N43,IF($O$54=100,$O43,IF($P$54=100,$P43,IF($Q$54=100,$Q43,IF($R$54=100,$R43,$R43))))))","v":0.1},{"$f":"IF(D53=\"\",0,100-G43)","v":0},{"$f":"IF(H43>9.9,ROUND(H43,0),ROUND(H43,1))","v":0},null,null,null,{"$f":"ROUND(IF(B43=\"\",0,SUM(B43/$B$41)*100),1)","v":0},{"$f":"IF(M43=K44,L44,M43)","v":0},{"$f":"IF(N43=K$46,L$46,N43)","v":0.1},{"$f":"IF(O43=K$47,L$47,O43)","v":0.1},{"$f":"IF(P43=K$48,L$48,P43)","v":0.1},{"$f":"IF(Q43=K$48,L$48,Q43)","v":0.1}]
["3/8\" (9.5mm) Sieve   ",null,{"$f":"IF(AND(D43=\"\", B41>0), \"Please select a sieve size\",\"\")","v":""},null,null,null,0.1,{"$f":"IF(H43=\"\",0,(H43-G44))","v":0},0,{"$f":"IF('Proj Info'!B104=\" \",\" \",'Proj Info'!B104)","v":""},null,null,{"$f":"ROUND(IF(B44=\"\",0,SUM(B44/$B$41)*100),1)","v":0},{"$f":"IF(M44=K45,L45,M44)","v":0.1},{"$f":"IF(N44=K$46,L$46,N44)","v":0.1},{"$f":"IF(O44=K$47,L$47,O44)","v":0.1},{"$f":"IF(P44=K$48,L$48,P44)","v":0.1},{"$f":"IF(Q44=K$48,L$48,Q44)","v":0.1},null,null,8]
["#4 (4.75mm) Sieve   ",null,null,null,null,null,0.1,{"$f":"IF(H44=\"\",0,(H44-G45))","v":0},0,{"$f":"IF('Proj Info'!B105=\" \",\" \",'Proj Info'!B105)","v":""},{"$f":"LARGE(M45:M49,1)","v":0},{"$f":"IF(M54<100,(K45+0.1),IF(M54>100,(K45-0.1),K45))","v":0.1},0,{"$f":"IF(M45=$K$45,$L$45,M45)","v":0.1},0.1,0.1,0.1,{"$f":"IF(Q45=K$49,L$49,Q45)","v":0.1},null,null,12]
["#8 (2.36mm) Sieve   ",null,{"$f":"IF(AND(D43=8, OR(B44>200,B45>200,B46>200,B47>200,B48>200,B49>200,B50>200,B51>200,B52>200)), \"IM 302 >200g retained\",\"\")","v":""},null,null,null,0.1,0,0,{"$f":"IF('Proj Info'!B106=\" \",\" \",'Proj Info'!B106)","v":""},{"$f":"LARGE(M45:M49,2)","v":0},{"$f":"IF(N54<100,(K46+0.1),IF(N54>100,(K46-0.1),K46))","v":0.1},0,0.1,0.1,0.1,0.1,0.1,null,{"$f":"IF(AND(B41>0,D43=\"\"),\"N\",\"Y\")","v":"Y"},"8 Combined"]
["#16 (1.18mm) Sieve   ",null,null,null,null,null,0.1,0,0,null,{"$f":"LARGE(M45:M49,3)","v":0},{"$f":"IF(O54>100,K47-0.1,IF(O54<100,K47+0.1,K47))","v":0.1},0,0.1,0.1,0.1,0.1,0.1]
["#30 (600 µm) Sieve   ",null,null,null,null,null,0.1,0,0,{"$f":"IF('Proj Info'!B107=\" \",\" \",'Proj Info'!B107)","v":""},{"$f":"LARGE(M45:M49,4)","v":0},{"$f":"IF(P54>100,K48-0.1,IF(P54<100,K48+0.1,K48))","v":0.1},0,0.1,0.1,0.1,0.1,0.1]
["#50 (300 µm)  Sieve   ",null,null,{"$f":"IF(AND(T42=1, OR(G43>40.4,G44>40.4,G45>40.4,G46>40.4,G47>40.4,G48>40.4,G49>40.4,G50>40.4,G51>40.4)), \"Gradation Table, Note 1- No more than 40% shall pass one sieve and be retained on the sieve with the next higher number\",\"\")","v":""},null,null,0.1,0,0,null,{"$f":"LARGE(M45:M49,5)","v":0},{"$f":"IF(Q54>100,K49-0.1,IF(Q54<100,K49+0.1,K49))","v":0.1},0,0.1,0.1,0.1,0.1,0.1]
["#100 (150 µm) Sieve   ",null,null,null,null,null,0.1,0,0,null,null,null,0,0.1,0.1,0.1,0.1,0.1]
["#200 (75 µm) Sieve   ",null,null,null,null,null,0.1,{"$f":"IF(H50=\"\",0,(H50-G51))","v":0},{"$f":"IF(H51>9.9,ROUND(H51,0),ROUND(H51,10))","v":0},{"$f":"IF('Proj Info'!B108=\" \",\" \",'Proj Info'!B108)","v":""},null,null,0,0.1,0.1,0.1,0.1,0.1]
["   Pan  ",null,null,"Total",null,null,{"$f":"IF($M$54=100,$M52,IF($N$54=100,$N52,IF($O$54=100,$O52,IF($P$54=100,$P52,IF($Q$54=100,$Q52,IF($R$54=100,$R52,$R52))))))","v":0.1},null,null,null,null,null,{"$f":"ROUND(IF(B52=\"\",0,SUM((B52+B53)/$B$41)*100),1)","v":0},0.1,0.1,0.1,0.1,0.1]
["   Wash  ",{"$f":"IF(B42=\"\",0,SUM(B41-B42))","v":0},null,{"$f":"IF(B52=\"\",0,SUM(B43:B53))","v":0},null,null,{"$f":"IF(G52=\"\",0,SUM(G43:G52))","v":0.99999999999999989},"FM:",{"$f":"IF(B41=\"\",\"\",(800-(SUM(H44:H50)+H43))/100)","v":""}]
["Complies (Y/N)",{"$f":"IF(AND(T41=\"N\",B41>0),\"N\",IF(AND(T46=\"N\",B41>0),\"N\",\"Y\"))","v":"Y"},null,null,null,null,null,null,null,null,null,null,{"$f":"ROUND(IF(M52>=0,SUM(M43:M52)),1)","v":0},0.9,1,1,1,1]

{"sheet":"Combined","index":9,"n_rows":77,"n_cols":12,"rows_kept":77,"cut":false,"hidden":true,"merged":[]}
[]
[]
["GRADATION 1",null,null,null,null,"ENTER"]
["Volume of Coarse Aggregate per Cubic Yard",null,null,null,null,{"$f":"IF('Mix Info'!H5=\"\",\"\",'Mix Info'!H5)","v":""},{"$f":"IF(F4=\"\",0,F4/(SUM($F$4:$F$6)))","v":0}]
["Volume of Intermediate Aggregate per Cubic Yard",null,null,null,null,{"$f":"IF('Mix Info'!H6=\"\",\"\",'Mix Info'!H6)","v":""},{"$f":"IF(F5=\"\",0,F5/(SUM($F$4:$F$6)))","v":0}]
["Volume of Fine Aggregate per Cubic Yard",null,null,null,null,{"$f":"IF('Mix Info'!H7=\"\",\"\",'Mix Info'!H7)","v":""},{"$f":"IF(F6=\"\",0,F6/(SUM($F$4:F$6)))","v":0}]
[null,null,null,null,null,{"$f":"SUM(F4:F6)","v":0}]
[]
[]
[]
[]
[]
[null,"Coarse","Intermediate","Fine",null,"Combined","CDM","CDM","CDM"]
["Sieve","Aggregate","Aggregate","Aggregate",null,"Gradation","Target","Minimum","Maximum","Within"]
["Size","Grad 1","Grad 1","Grad 1",null,"Percent","Percent","Percent","Percent","Target"]
[null,"Passing","Passing","Passing",null,"Passing","Passing","Passing","Passing"]
[null,null,null,null,null,null,"ENTER"]
["1.5\"",{"$f":"'Grad 1'!I5","v":0},{"$f":"'Grad 1'!I23","v":0},100,{"$f":"IF('Grad 1'!$B$4=0,\"\",IF($F$7<>100,\"\",B18*$G$4+C18*$G$5+D18*G$6))","v":""},{"$f":"IF(ISBLANK(E18),\"\",E18)","v":""},{"$f":"'Mix Info'!K8","v":0},{"$f":"IF(G18-5<0,0,IF((G18-5)>10,ROUND(G18-5,1),ROUND(G18-5,0)))","v":0},{"$f":"IF(G18+5>100,100,IF(G18+5>10,ROUND(G18+5,0),ROUND(G18+5,1)))","v":5},{"$f":"IF(AND(H18<=E18,E18<=I18),\"Yes\",\"No\")","v":"No"},{"$f":"IF(J18=\"YES\",1,0)","v":0},{"$f":"IF(OR('Mix Info'!$B$2=\"QMC\", 'Mix Info'!$B$2=\"C-SUD\", 'Mix Info'!$B$2=\"QMPEM\",'Mix Info'!$C$2=\"QMC\", 'Mix Info'!$C$2=\"C-SUD\", 'Mix Info'!$C$2=\"QMPEM\",'Mix Info'!$D$2=\"QMC\", 'Mix Info'!$D$2=\"C-SUD\", 'Mix Info'!$D$2=\"QMPEM\",'Mix Info'!$E$2=\"QMC\", 'Mix Info'!$E$2=\"C-SUD\", 'Mix Info'!$E$2=\"QMPEM\",'Mix Info'!$F$2=\"QMC\", 'Mix Info'!$F$2=\"C-SUD\", 'Mix Info'!$F$2=\"QMPEM\"),CONCATENATE($H18,\"-\",$I18),\" \")","v":" "}]
["1\"",{"$f":"'Grad 1'!I6","v":0},{"$f":"'Grad 1'!I24","v":0},100,{"$f":"IF('Grad 1'!$B$4=0,\"\",IF($F$7<>100,\"\",B19*$G$4+C19*$G$5+D19*G$6))","v":""},{"$f":"IF(ISBLANK(E19),\"\",E19)","v":""},{"$f":"'Mix Info'!K9","v":0},0,{"$f":"IF(G19+5>100,100,IF(G19+5>10,ROUND(G19+5,0),ROUND(G19+5,1)))","v":5},"No",{"$f":"IF(J19=\"YES\",1,0)","v":0},{"$f":"IF(OR('Mix Info'!$B$2=\"QMC\", 'Mix Info'!$B$2=\"C-SUD\", 'Mix Info'!$B$2=\"QMPEM\",'Mix Info'!$C$2=\"QMC\", 'Mix Info'!$C$2=\"C-SUD\", 'Mix Info'!$C$2=\"QMPEM\",'Mix Info'!$D$2=\"QMC\", 'Mix Info'!$D$2=\"C-SUD\", 'Mix Info'!$D$2=\"QMPEM\",'Mix Info'!$E$2=\"QMC\", 'Mix Info'!$E$2=\"C-SUD\", 'Mix Info'!$E$2=\"QMPEM\",'Mix Info'!$F$2=\"QMC\", 'Mix Info'!$F$2=\"C-SUD\", 'Mix Info'!$F$2=\"QMPEM\"),CONCATENATE($H19,\"-\",$I19),\" \")","v":" "}]
["3/4\"",{"$f":"'Grad 1'!I7","v":0},{"$f":"'Grad 1'!I25","v":0},100,{"$f":"IF('Grad 1'!$B$4=0,\"\",IF($F$7<>100,\"\",B20*$G$4+C20*$G$5+D20*G$6))","v":""},"",{"$f":"'Mix Info'!K10","v":0},0,{"$f":"IF(G20+5>100,100,IF(G20+5>10,ROUND(G20+5,1),ROUND(G20+5,0)))","v":5},"No",0,{"$f":"IF(OR('Mix Info'!$B$2=\"QMC\", 'Mix Info'!$B$2=\"C-SUD\", 'Mix Info'!$B$2=\"QMPEM\",'Mix Info'!$C$2=\"QMC\", 'Mix Info'!$C$2=\"C-SUD\", 'Mix Info'!$C$2=\"QMPEM\",'Mix Info'!$D$2=\"QMC\", 'Mix Info'!$D$2=\"C-SUD\", 'Mix Info'!$D$2=\"QMPEM\",'Mix Info'!$E$2=\"QMC\", 'Mix Info'!$E$2=\"C-SUD\", 'Mix Info'!$E$2=\"QMPEM\",'Mix Info'!$F$2=\"QMC\", 'Mix Info'!$F$2=\"C-SUD\", 'Mix Info'!$F$2=\"QMPEM\"),CONCATENATE($H20,\"-\",$I20),\" \")","v":" "}]
["1/2\"",{"$f":"'Grad 1'!I8","v":0},{"$f":"'Grad 1'!I26","v":0},{"$f":"'Grad 1'!I43","v":0},{"$f":"IF('Grad 1'!$B$4=0,\"\",IF($F$7<>100,\"\",B21*$G$4+C21*$G$5+D21*G$6))","v":""},"",{"$f":"'Mix Info'!K11","v":0},0,{"$f":"IF(G21+5>100,100,IF(G21+5>10,ROUND(G21+5,1),ROUND(G21+5,0)))","v":5},"No",0,{"$f":"IF(OR('Mix Info'!$B$2=\"QMC\", 'Mix Info'!$B$2=\"C-SUD\", 'Mix Info'!$B$2=\"QMPEM\",'Mix Info'!$C$2=\"QMC\", 'Mix Info'!$C$2=\"C-SUD\", 'Mix Info'!$C$2=\"QMPEM\",'Mix Info'!$D$2=\"QMC\", 'Mix Info'!$D$2=\"C-SUD\", 'Mix Info'!$D$2=\"QMPEM\",'Mix Info'!$E$2=\"QMC\", 'Mix Info'!$E$2=\"C-SUD\", 'Mix Info'!$E$2=\"QMPEM\",'Mix Info'!$F$2=\"QMC\", 'Mix Info'!$F$2=\"C-SUD\", 'Mix Info'!$F$2=\"QMPEM\"),CONCATENATE($H21,\"-\",$I21),\" \")","v":" "}]
["3/8\"",{"$f":"'Grad 1'!I9","v":0},{"$f":"'Grad 1'!I27","v":0},{"$f":"'Grad 1'!I44","v":0},{"$f":"IF('Grad 1'!$B$4=0,\"\",IF($F$7<>100,\"\",B22*$G$4+C22*$G$5+D22*G$6))","v":""},"",{"$f":"'Mix Info'!K12","v":0},0,{"$f":"IF(G22+5>100,100,IF(G22+5>10,ROUND(G22+5,1),ROUND(G22+5,0)))","v":5},"No",0,{"$f":"IF(OR('Mix Info'!$B$2=\"QMC\", 'Mix Info'!$B$2=\"C-SUD\", 'Mix Info'!$B$2=\"QMPEM\",'Mix Info'!$C$2=\"QMC\", 'Mix Info'!$C$2=\"C-SUD\", 'Mix Info'!$C$2=\"QMPEM\",'Mix Info'!$D$2=\"QMC\", 'Mix Info'!$D$2=\"C-SUD\", 'Mix Info'!$D$2=\"QMPEM\",'Mix Info'!$E$2=\"QMC\", 'Mix Info'!$E$2=\"C-SUD\", 'Mix Info'!$E$2=\"QMPEM\",'Mix Info'!$F$2=\"QMC\", 'Mix Info'!$F$2=\"C-SUD\", 'Mix Info'!$F$2=\"QMPEM\"),CONCATENATE($H22,\"-\",$I22),\" \")","v":" "}]
["#4",{"$f":"'Grad 1'!I10","v":0},{"$f":"'Grad 1'!I28","v":0},{"$f":"'Grad 1'!I45","v":0},{"$f":"IF('Grad 1'!$B$4=0,\"\",IF($F$7<>100,\"\",B23*$G$4+C23*$G$5+D23*G$6))","v":""},"",{"$f":"'Mix Info'!K13","v":0},0,{"$f":"IF(G23+5>100,100,IF(G23+5>10,ROUND(G23+5,1),ROUND(G23+5,0)))","v":5},"No",0,{"$f":"IF(OR('Mix Info'!$B$2=\"QMC\", 'Mix Info'!$B$2=\"C-SUD\", 'Mix Info'!$B$2=\"QMPEM\",'Mix Info'!$C$2=\"QMC\", 'Mix Info'!$C$2=\"C-SUD\", 'Mix Info'!$C$2=\"QMPEM\",'Mix Info'!$D$2=\"QMC\", 'Mix Info'!$D$2=\"C-SUD\", 'Mix Info'!$D$2=\"QMPEM\",'Mix Info'!$E$2=\"QMC\", 'Mix Info'!$E$2=\"C-SUD\", 'Mix Info'!$E$2=\"QMPEM\",'Mix Info'!$F$2=\"QMC\", 'Mix Info'!$F$2=\"C-SUD\", 'Mix Info'!$F$2=\"QMPEM\"),CONCATENATE($H23,\"-\",$I23),\" \")","v":" "}]
["#8",{"$f":"'Grad 1'!I11","v":0},{"$f":"'Grad 1'!I29","v":0},{"$f":"'Grad 1'!I46","v":0},{"$f":"IF('Grad 1'!$B$4=0,\"\",IF($F$7<>100,\"\",B24*$G$4+C24*$G$5+D24*G$6))","v":""},"",{"$f":"'Mix Info'!K14","v":0},{"$f":"IF((G24-4)>0,G24-4,0)","v":0},{"$f":"IF(G24+4>10,ROUND(G24+4,1),ROUND(G24+4,0))","v":4},"No",0,{"$f":"IF(OR('Mix Info'!$B$2=\"QMC\", 'Mix Info'!$B$2=\"C-SUD\", 'Mix Info'!$B$2=\"QMPEM\",'Mix Info'!$C$2=\"QMC\", 'Mix Info'!$C$2=\"C-SUD\", 'Mix Info'!$C$2=\"QMPEM\",'Mix Info'!$D$2=\"QMC\", 'Mix Info'!$D$2=\"C-SUD\", 'Mix Info'!$D$2=\"QMPEM\",'Mix Info'!$E$2=\"QMC\", 'Mix Info'!$E$2=\"C-SUD\", 'Mix Info'!$E$2=\"QMPEM\",'Mix Info'!$F$2=\"QMC\", 'Mix Info'!$F$2=\"C-SUD\", 'Mix Info'!$F$2=\"QMPEM\"),CONCATENATE($H24,\"-\",$I24),\" \")","v":" "}]
["#16",{"$f":"B24-($B$24-$B$29)/5","v":0},{"$f":"C24-($C$24-$C$29)/5","v":0},{"$f":"'Grad 1'!I47","v":0},{"$f":"IF('Grad 1'!$B$4=0,\"\",IF($F$7<>100,\"\",B25*$G$4+C25*$G$5+D25*G$6))","v":""},"",{"$f":"'Mix Info'!K15","v":0},{"$f":"IF((G25-4)>0,G25-4,0)","v":0},{"$f":"IF(G25+4>10,ROUND(G25+4,1),ROUND(G25+4,0))","v":4},"No",0,{"$f":"IF(OR('Mix Info'!$B$2=\"QMC\", 'Mix Info'!$B$2=\"C-SUD\", 'Mix Info'!$B$2=\"QMPEM\",'Mix Info'!$C$2=\"QMC\", 'Mix Info'!$C$2=\"C-SUD\", 'Mix Info'!$C$2=\"QMPEM\",'Mix Info'!$D$2=\"QMC\", 'Mix Info'!$D$2=\"C-SUD\", 'Mix Info'!$D$2=\"QMPEM\",'Mix Info'!$E$2=\"QMC\", 'Mix Info'!$E$2=\"C-SUD\", 'Mix Info'!$E$2=\"QMPEM\",'Mix Info'!$F$2=\"QMC\", 'Mix Info'!$F$2=\"C-SUD\", 'Mix Info'!$F$2=\"QMPEM\"),CONCATENATE($H25,\"-\",$I25),\" \")","v":" "}]
["#30",{"$f":"B25-($B$24-$B$29)/5","v":0},{"$f":"C25-($C$24-$C$29)/5","v":0},{"$f":"'Grad 1'!I48","v":0},{"$f":"IF('Grad 1'!$B$4=0,\"\",IF($F$7<>100,\"\",B26*$G$4+C26*$G$5+D26*G$6))","v":""},"",{"$f":"'Mix Info'!K16","v":0},{"$f":"IF((G26-4)>0,G26-4,0)","v":0},{"$f":"IF(G26+4>10,ROUND(G26+4,1),ROUND(G26+4,1))","v":4},"No",0,{"$f":"IF(OR('Mix Info'!$B$2=\"QMC\", 'Mix Info'!$B$2=\"C-SUD\", 'Mix Info'!$B$2=\"QMPEM\",'Mix Info'!$C$2=\"QMC\", 'Mix Info'!$C$2=\"C-SUD\", 'Mix Info'!$C$2=\"QMPEM\",'Mix Info'!$D$2=\"QMC\", 'Mix Info'!$D$2=\"C-SUD\", 'Mix Info'!$D$2=\"QMPEM\",'Mix Info'!$E$2=\"QMC\", 'Mix Info'!$E$2=\"C-SUD\", 'Mix Info'!$E$2=\"QMPEM\",'Mix Info'!$F$2=\"QMC\", 'Mix Info'!$F$2=\"C-SUD\", 'Mix Info'!$F$2=\"QMPEM\"),CONCATENATE($H26,\"-\",$I26),\" \")","v":" "}]
["#50",{"$f":"B26-($B$24-$B$29)/5","v":0},{"$f":"C26-($C$24-$C$29)/5","v":0},{"$f":"'Grad 1'!I49","v":0},{"$f":"IF('Grad 1'!$B$4=0,\"\",IF($F$7<>100,\"\",B27*$G$4+C27*$G$5+D27*G$6))","v":""},"",{"$f":"'Mix Info'!K17","v":0},{"$f":"IF((G27-3)>0,G27-3,0)","v":0},{"$f":"IF(G27+3>10,ROUND(G27+3,0),ROUND(G27+3,1))","v":3},"No",0,{"$f":"IF(OR('Mix Info'!$B$2=\"QMC\", 'Mix Info'!$B$2=\"C-SUD\", 'Mix Info'!$B$2=\"QMPEM\",'Mix Info'!$C$2=\"QMC\", 'Mix Info'!$C$2=\"C-SUD\", 'Mix Info'!$C$2=\"QMPEM\",'Mix Info'!$D$2=\"QMC\", 'Mix Info'!$D$2=\"C-SUD\", 'Mix Info'!$D$2=\"QMPEM\",'Mix Info'!$E$2=\"QMC\", 'Mix Info'!$E$2=\"C-SUD\", 'Mix Info'!$E$2=\"QMPEM\",'Mix Info'!$F$2=\"QMC\", 'Mix Info'!$F$2=\"C-SUD\", 'Mix Info'!$F$2=\"QMPEM\"),CONCATENATE($H27,\"-\",$I27),\" \")","v":" "}]
["#100",{"$f":"B27-($B$24-$B$29)/5","v":0},{"$f":"C27-($C$24-$C$29)/5","v":0},{"$f":"'Grad 1'!I50","v":0},{"$f":"IF('Grad 1'!$B$4=0,\"\",IF($F$7<>100,\"\",B28*$G$4+C28*$G$5+D28*G$6))","v":""},"",{"$f":"'Mix Info'!K18","v":0},{"$f":"IF((G28-2)>0,G28-2,0)","v":0},{"$f":"IF(G28+2>10,ROUND(G28+2,0),ROUND(G28+2,1))","v":2},"No",0,{"$f":"IF(OR('Mix Info'!$B$2=\"QMC\", 'Mix Info'!$B$2=\"C-SUD\", 'Mix Info'!$B$2=\"QMPEM\",'Mix Info'!$C$2=\"QMC\", 'Mix Info'!$C$2=\"C-SUD\", 'Mix Info'!$C$2=\"QMPEM\",'Mix Info'!$D$2=\"QMC\", 'Mix Info'!$D$2=\"C-SUD\", 'Mix Info'!$D$2=\"QMPEM\",'Mix Info'!$E$2=\"QMC\", 'Mix Info'!$E$2=\"C-SUD\", 'Mix Info'!$E$2=\"QMPEM\",'Mix Info'!$F$2=\"QMC\", 'Mix Info'!$F$2=\"C-SUD\", 'Mix Info'!$F$2=\"QMPEM\"),CONCATENATE($H28,\"-\",$I28),\" \")","v":" "}]
["#200",{"$f":"'Grad 1'!I14","v":0},{"$f":"'Grad 1'!I32","v":0},{"$f":"'Grad 1'!I51","v":0},{"$f":"IF('Grad 1'!$B$4=0,\"\",IF($F$7<>100,\"\",B29*$G$4+C29*$G$5+D29*G$6))","v":""},"",{"$f":"'Mix Info'!K19","v":2},0,{"$f":"G29","v":2},"No",0,{"$f":"IF(OR('Mix Info'!$B$2=\"QMC\", 'Mix Info'!$B$2=\"C-SUD\", 'Mix Info'!$B$2=\"QMPEM\",'Mix Info'!$C$2=\"QMC\", 'Mix Info'!$C$2=\"C-SUD\", 'Mix Info'!$C$2=\"QMPEM\",'Mix Info'!$D$2=\"QMC\", 'Mix Info'!$D$2=\"C-SUD\", 'Mix Info'!$D$2=\"QMPEM\",'Mix Info'!$E$2=\"QMC\", 'Mix Info'!$E$2=\"C-SUD\", 'Mix Info'!$E$2=\"QMPEM\",'Mix Info'!$F$2=\"QMC\", 'Mix Info'!$F$2=\"C-SUD\", 'Mix Info'!$F$2=\"QMPEM\"),CONCATENATE($H29,\"-\",$I29),\" \")","v":" "}]
[null,null,null,null,null,null,null,null,null,null,{"$f":"+SUM(K18:K29)","v":0},{"$f":"IF(K30=12,\"Y\",\"N\")","v":"N"}]
[null,null,null,null,"CF",{"$f":"IF('Grad 1'!B4=0,0,((100-F18)+(F18-F19)+(F19-F20)+(F20-F21)+(F21-F22))/((100-F18)+(F18-F19)+(F19-F20)+(F20-F21)+(F21-F22)+(F22-F23)+(F23-F24))*100)","v":0}]
[null,null,null,null,"WF",{"$f":"IF(F24=\"\",\"\",F24)","v":""},{"$f":"IF(AND($F$31<72,$F$31>45,$F$32>-0.140625*$F$31+48.35,$F$32<-0.140625*$F$31+50.06),\"II-C\",IF(AND($F$31<72,$F$31>45,$F$32>-0.140625*$F$31+46.64,$F$32<-0.140625*$F$31+48.35),\"II-B\",IF(AND($F$31<72,$F$31>45,$F$32>-0.140625*$F$31+41.23,$F$32<-0.140625*$F$31+46.64),\"II-A\",IF(AND($F$31<72,$F$31>45,$F$32>-0.140625*$F$31+39.93,$F$32<-0.140625*$F$31+41.23),\"II-C\",IF(AND($F$31<72,$F$31>45,$F$32>-0.140625*$F$31+39.2,$F$32<-0.140625*$F$31+39.93),\"II-D\",H32)))))","v":"O"},{"$f":"IF(AND($F$31<100,$F$31>0,$F$32>-0.140625*$F$31+50.06),\"IV\",IF(AND($F$31<75,$F$31>=45,$F$32>-0.140625*$F$31+39.2,$F$32<-0.140625*$F$31+50.06),\"II\",IF(AND($F$31<45,$F$32>-0.140625*$F$31+39.2,$F$32<-0.140625*$F$31+50.06),\"III\",IF(AND($F$31>75,$F$32>-0.140625*$F$31+39.2,$F$32<-0.140625*$F$31+50.06),\"I\",IF(AND($F$31<72,$F$31>45,$F$32<-0.140625*$F$31+39.2),\"V\",\"O\")))))","v":"O"}]
["Gradation 2"]
[]
[null,"Coarse","Intermediate","Fine",null,"Combined","CDM","CDM","CDM"]
["Sieve","Aggregate","Aggregate","Aggregate",null,"Gradation","Target","Minimum","Maximum","Within"]
["Size","Grad 2","Grad 2","Grad 2",null,"Percent","Percent","Percent","Percent","Target"]
[null,"Passing","Passing","Passing",null,"Passing","Passing","Passing","Passing"]
[]
["1.5\"",{"$f":"'Grad 2'!I5","v":0},{"$f":"'Grad 2'!I23","v":0},100,{"$f":"IF('Grad 2'!$B$4=0,\" \",IF($F$7<>100,\"\",(B40*$G$4)+(C40*$G$5)+(D40*G$6)))","v":" "},{"$f":"E40","v":" "},{"$f":"G18","v":0},{"$f":"IF((G40-5)>0,G40-5,0)","v":0},{"$f":"IF(G40+5>100,100,G40+5)","v":5},{"$f":"IF(AND(H40<=E40,E40<=I40),\"Yes\",\"No\")","v":"No"},{"$f":"IF(J40=\"YES\",1,0)","v":0}]
["1\"",{"$f":"'Grad 2'!I6","v":0},{"$f":"'Grad 2'!I24","v":0},100,{"$f":"IF('Grad 2'!$B$4=0,\" \",IF($F$7<>100,\"\",B41*$G$4+C41*$G$5+D41*G$6))","v":" "}," ",0,0,5,"No",{"$f":"IF(J41=\"YES\",1,0)","v":0}]
["3/4\"",{"$f":"'Grad 2'!I7","v":0},{"$f":"'Grad 2'!I25","v":0},100,{"$f":"IF('Grad 2'!$B$4=0,\" \",IF($F$7<>100,\"\",B42*$G$4+C42*$G$5+D42*G$6))","v":" "}," ",0,0,5,"No",0]
["1/2\"",{"$f":"'Grad 2'!I8","v":0},{"$f":"'Grad 2'!I26","v":0},{"$f":"'Grad 2'!I43","v":0},{"$f":"IF('Grad 2'!$B$4=0,\" \",IF($F$7<>100,\"\",B43*$G$4+C43*$G$5+D43*G$6))","v":" "}," ",0,0,5,"No",0]
["3/8\"",{"$f":"'Grad 2'!I9","v":0},{"$f":"'Grad 2'!I27","v":0},{"$f":"'Grad 2'!I44","v":0},{"$f":"IF('Grad 2'!$B$4=0,\" \",IF($F$7<>100,\"\",B44*$G$4+C44*$G$5+D44*G$6))","v":" "}," ",0,0,5,"No",0]
["#4",{"$f":"'Grad 2'!I10","v":0},{"$f":"'Grad 2'!I28","v":0},{"$f":"'Grad 2'!I45","v":0},{"$f":"IF('Grad 2'!$B$4=0,\" \",IF($F$7<>100,\"\",B45*$G$4+C45*$G$5+D45*G$6))","v":" "}," ",0,0,5,"No",0]
["#8",{"$f":"'Grad 2'!I11","v":0},{"$f":"'Grad 2'!I29","v":0},{"$f":"'Grad 2'!I46","v":0},{"$f":"IF('Grad 2'!$B$4=0,\" \",IF($F$7<>100,\"\",B46*$G$4+C46*$G$5+D46*G$6))","v":" "}," ",0,{"$f":"IF((G46-4)>0,G46-4,0)","v":0},{"$f":"G46+4","v":4},"No",0]
["#16",{"$f":"B46-($B$46-$B$51)/5","v":0},{"$f":"C46-($C$46-$C$51)/5","v":0},{"$f":"'Grad 2'!I47","v":0},{"$f":"IF('Grad 2'!$B$4=0,\" \",IF($F$7<>100,\"\",B47*$G$4+C47*$G$5+D47*G$6))","v":" "}," ",0,{"$f":"IF((G47-4)>0,G47-4,0)","v":0},{"$f":"G47+4","v":4},"No",0]
["#30",{"$f":"B47-($B$46-$B$51)/5","v":0},{"$f":"C47-($C$46-$C$51)/5","v":0},{"$f":"'Grad 2'!I48","v":0},{"$f":"IF('Grad 2'!$B$4=0,\" \",IF($F$7<>100,\"\",B48*$G$4+C48*$G$5+D48*G$6))","v":" "}," ",0,{"$f":"IF((G48-4)>0,G48-4,0)","v":0},{"$f":"G48+4","v":4},"No",0]
["#50",{"$f":"B48-($B$46-$B$51)/5","v":0},{"$f":"C48-($C$46-$C$51)/5","v":0},{"$f":"'Grad 2'!I49","v":0},{"$f":"IF('Grad 2'!$B$4=0,\" \",IF($F$7<>100,\"\",B49*$G$4+C49*$G$5+D49*G$6))","v":" "}," ",0,{"$f":"IF((G49-3)>0,G49-3,0)","v":0},{"$f":"G49+3","v":3},"No",0]
["#100",{"$f":"B49-($B$46-$B$51)/5","v":0},{"$f":"C49-($C$46-$C$51)/5","v":0},{"$f":"'Grad 2'!I50","v":0},{"$f":"IF('Grad 2'!$B$4=0,\" \",IF($F$7<>100,\"\",B50*$G$4+C50*$G$5+D50*G$6))","v":" "}," ",0,{"$f":"IF((G50-2)>0,G50-2,0)","v":0},{"$f":"G50+2","v":2},"No",0]
["#200",{"$f":"'Grad 2'!$I$14","v":0},{"$f":"'Grad 2'!$I$32","v":0},{"$f":"'Grad 2'!I51","v":0},{"$f":"IF('Grad 2'!$B$4=0,\" \",IF($F$7<>100,\"\",B51*$G$4+C51*$G$5+D51*G$6))","v":" "}," ",2,0,{"$f":"G29","v":2},"No",0]
[null,null,null,null,null,null,null,null,null,null,{"$f":"+SUM(K40:K51)","v":0},{"$f":"IF(K52=12,\"Y\",\"N\")","v":"N"}]
[null,null,null,null,"CF",{"$f":"IF('Grad 2'!B4=0,0,((100-F40)+(F40-F41)+(F41-F42)+(F42-F43)+(F43-F44))/((100-F40)+(F40-F41)+(F41-F42)+(F42-F43)+(F43-F44)+(F44-F45)+(F45-F46))*100)","v":0}]
[null,null,null,null,"WF",{"$f":"IF(F46=\"\",\"\",F46)","v":" "},{"$f":"IF(AND($F$53<72,$F$53>45,$F$54>-0.140625*$F$53+48.35,$F$54<-0.140625*$F$53+50.06),\"II-C\",IF(AND($F$53<72,$F$53>45,$F$54>-0.140625*$F$53+46.64,$F$54<-0.140625*$F$53+48.35),\"II-B\",IF(AND($F$53<72,$F$53>45,$F$54>-0.140625*$F$53+41.23,$F$54<-0.140625*$F$53+46.64),\"II-A\",IF(AND($F$53<72,$F$53>45,$F$54>-0.140625*$F$53+39.93,$F$54<-0.140625*$F$53+41.23),\"II-C\",IF(AND($F$53<72,$F$53>45,$F$54>-0.140625*$F$53+39.2,$F$54<-0.140625*$F$53+39.93),\"II-D\",H54)))))","v":"O"},{"$f":"IF(AND($F$53<100,$F$53>0,$F$54>-0.140625*$F$53+50.06),\"IV\",IF(AND($F$53<75,$F$53>=45,$F$54>-0.140625*$F$53+39.2,$F$54<-0.140625*$F$53+50.06),\"II\",IF(AND($F$53<45,$F$54>-0.140625*$F$53+39.2,$F$54<-0.140625*$F$53+50.06),\"III\",IF(AND($F$53>75,$F$54>-0.140625*$F$53+39.2,$F$54<-0.140625*$F$53+50.06),\"I\",IF(AND($F$53<72,$F$53>45,$F$54<-0.140625*$F$53+39.2),\"V\",\"O\")))))","v":"O"}]
[]
["Gradation 3"]
[]
[null,"Coarse","Intermediate","Fine",null,"Combined","CDM","CDM","CDM"]
["Sieve","Aggregate","Aggregate","Aggregate",null,"Gradation","Target","Minimum","Maximum","Within"]
["Size","Grad 3","Grad 3","Grad 3",null,"Percent","Percent","Percent","Percent","Target"]
[null,"Passing","Passing","Passing",null,"Passing","Passing","Passing","Passing"]
[]
["1.5\"",{"$f":"'Grad 3'!I5","v":0},{"$f":"'Grad 3'!I23","v":0},100,{"$f":"IF('Grad 3'!$B$4=0,\" \",IF($F$7<>100,\"\",B63*$G$4+C63*$G$5+D63*G$6))","v":" "},{"$f":"E63","v":" "},{"$f":"G18","v":0},{"$f":"IF((G63-5)>0,G63-5,0)","v":0},{"$f":"IF(G63+5>100,100,G63+5)","v":5},{"$f":"IF(AND(H63<=E63,E63<=I63),\"Yes\",\"No\")","v":"No"},{"$f":"IF(J63=\"YES\",1,0)","v":0}]
["1\"",{"$f":"'Grad 3'!I6","v":0},{"$f":"'Grad 3'!I24","v":0},100,{"$f":"IF('Grad 3'!$B$4=0,\" \",IF($F$7<>100,\"\",B64*$G$4+C64*$G$5+D64*G$6))","v":" "}," ",0,0,5,"No",{"$f":"IF(J64=\"YES\",1,0)","v":0}]
["3/4\"",{"$f":"'Grad 3'!I7","v":0},{"$f":"'Grad 3'!I25","v":0},100,{"$f":"IF('Grad 3'!$B$4=0,\" \",IF($F$7<>100,\"\",B65*$G$4+C65*$G$5+D65*G$6))","v":" "}," ",0,0,5,"No",0]
["1/2\"",{"$f":"'Grad 3'!I8","v":0},{"$f":"'Grad 3'!I26","v":0},{"$f":"'Grad 3'!I43","v":0},{"$f":"IF('Grad 3'!$B$4=0,\" \",IF($F$7<>100,\"\",B66*$G$4+C66*$G$5+D66*G$6))","v":" "}," ",0,0,5,"No",0]
["3/8\"",{"$f":"'Grad 3'!I9","v":0},{"$f":"'Grad 3'!I27","v":0},{"$f":"'Grad 3'!I44","v":0},{"$f":"IF('Grad 3'!$B$4=0,\" \",IF($F$7<>100,\"\",B67*$G$4+C67*$G$5+D67*G$6))","v":" "}," ",0,0,5,"No",0]
["#4",{"$f":"'Grad 3'!I10","v":0},{"$f":"'Grad 3'!I28","v":0},{"$f":"'Grad 3'!I45","v":0},{"$f":"IF('Grad 3'!$B$4=0,\" \",IF($F$7<>100,\"\",B68*$G$4+C68*$G$5+D68*G$6))","v":" "}," ",0,0,5,"No",0]
["#8",{"$f":"'Grad 3'!I11","v":0},{"$f":"'Grad 3'!I29","v":0},{"$f":"'Grad 3'!I46","v":0},{"$f":"IF('Grad 3'!$B$4=0,\" \",IF($F$7<>100,\"\",B69*$G$4+C69*$G$5+D69*G$6))","v":" "}," ",0,{"$f":"IF((G69-4)>0,G69-4,0)","v":0},{"$f":"G69+4","v":4},"No",0]
["#16",{"$f":"B69-($B$69-$B$74)/5","v":0},{"$f":"C69-($C$69-$C$74)/5","v":0},{"$f":"'Grad 3'!I47","v":0},{"$f":"IF('Grad 3'!$B$4=0,\" \",IF($F$7<>100,\"\",B70*$G$4+C70*$G$5+D70*G$6))","v":" "}," ",0,{"$f":"IF((G70-4)>0,G70-4,0)","v":0},{"$f":"G70+4","v":4},"No",0]
["#30",{"$f":"B70-($B$69-$B$74)/5","v":0},{"$f":"C70-($C$69-$C$74)/5","v":0},{"$f":"'Grad 3'!I48","v":0},{"$f":"IF('Grad 3'!$B$4=0,\" \",IF($F$7<>100,\"\",B71*$G$4+C71*$G$5+D71*G$6))","v":" "}," ",0,{"$f":"IF((G71-4)>0,G71-4,0)","v":0},{"$f":"G71+4","v":4},"No",0]
["#50",{"$f":"B71-($B$69-$B$74)/5","v":0},{"$f":"C71-($C$69-$C$74)/5","v":0},{"$f":"'Grad 3'!I49","v":0},{"$f":"IF('Grad 3'!$B$4=0,\" \",IF($F$7<>100,\"\",B72*$G$4+C72*$G$5+D72*G$6))","v":" "}," ",0,{"$f":"IF((G72-3)>0,G72-3,0)","v":0},{"$f":"G72+3","v":3},"No",0]
["#100",{"$f":"B72-($B$69-$B$74)/5","v":0},{"$f":"C72-($C$69-$C$74)/5","v":0},{"$f":"'Grad 3'!I50","v":0},{"$f":"IF('Grad 3'!$B$4=0,\" \",IF($F$7<>100,\"\",B73*$G$4+C73*$G$5+D73*G$6))","v":" "}," ",0,{"$f":"IF((G73-2)>0,G73-2,0)","v":0},{"$f":"G73+2","v":2},"No",0]
["#200",{"$f":"'Grad 3'!$I$14","v":0},{"$f":"'Grad 3'!$I$32","v":0},{"$f":"'Grad 3'!I51","v":0},{"$f":"IF('Grad 3'!$B$4=0,\" \",IF($F$7<>100,\"\",B74*$G$4+C74*$G$5+D74*G$6))","v":" "}," ",2,0,{"$f":"G29","v":2},"No",0]
[null,null,null,null,null,null,null,null,null,null,{"$f":"+SUM(K63:K74)","v":0},{"$f":"IF(K75=12,\"Y\",\"N\")","v":"N"}]
[null,null,null,null,"CF",{"$f":"IF('Grad 3'!B4=0,0,((100-F63)+(F63-F64)+(F64-F65)+(F65-F66)+(F66-F67))/((100-F63)+(F63-F64)+(F64-F65)+(F65-F66)+(F66-F67)+(F67-F68)+(F68-F69))*100)","v":0}]
[null,null,null,null,"WF",{"$f":"IF(F69=\"\",\"\",F69)","v":" "},{"$f":"IF(AND($F$76<72,$F$76>45,$F$77>-0.140625*$F$76+48.35,$F$77<-0.140625*$F$76+50.06),\"II-C\",IF(AND($F$76<72,$F$76>45,$F$77>-0.140625*$F$76+46.64,$F$77<-0.140625*$F$76+48.35),\"II-B\",IF(AND($F$76<72,$F$76>45,$F$77>-0.140625*$F$76+41.23,$F$77<-0.140625*$F$76+46.64),\"II-A\",IF(AND($F$76<72,$F$76>45,$F$77>-0.140625*$F$76+39.93,$F$77<-0.140625*$F$76+41.23),\"II-C\",IF(AND($F$76<72,$F$76>45,$F$77>-0.140625*$F$76+39.2,$F$77<-0.140625*$F$76+39.93),\"II-D\",H77)))))","v":"O"},{"$f":"IF(AND($F$76<100,$F$76>0,$F$77>-0.140625*$F$76+50.06),\"IV\",IF(AND($F$76<75,$F$76>=45,$F$77>-0.140625*$F$76+39.2,$F$77<-0.140625*$F$76+50.06),\"II\",IF(AND($F$76<45,$F$77>-0.140625*$F$76+39.2,$F$77<-0.140625*$F$76+50.06),\"III\",IF(AND($F$76>75,$F$77>-0.140625*$F$76+39.2,$F$77<-0.140625*$F$76+50.06),\"I\",IF(AND($F$76<72,$F$76>45,$F$77<-0.140625*$F$76+39.2),\"V\",\"O\")))))","v":"O"}]

{"sheet":"Gradation","index":10,"n_rows":42,"n_cols":3,"rows_kept":42,"cut":false,"hidden":true,"merged":[]}
["CW DATA"]
[]
[36,45]
[100,36]
[45,38.6]
[72,34.805]
[45,37.1]
[75,32.880000000000003]
[45,34.9]
[72,31.105]
[45,33.6]
[72,29.805]
[0,37.1,35.1]
[10,37.1,35.1]
[20,36.5,34.5]
[30,34.950000000000003,32.950000000000003]
[75,28.65,26.65]
[81.349999999999994,27.43,25.43]
[90,27,25]
[100,27,25]
[45,40.31]
[72,36.515000000000001]
[45,42.02]
[72,38.225000000000001]
[72,29.8]
[72,38.200000000000003]
[75,26.65]
[75,39.51]
[45,{"$f":"A29*-0.140625+50.06","v":43.731875000000002}]
[45,{"$f":"A30*-0.140625+37.2","v":30.871875000000003}]
[45,40.31]
[72,36.515000000000001]
[45,42.02]
[72,38.200000000000003]
[72,29.8]
[72,39.93]
[75,28.15]
[75,39.51]
[45,{"$f":"A39*-0.140625+50.06","v":43.731875000000002}]
[45,32.5]
[30,34.5]
[80,27.5]

{"sheet":"Maturity","index":12,"n_rows":196,"n_cols":13,"rows_kept":196,"cut":false,"hidden":false,"merged":[[0,0,1,14],[3,0,3,1],[4,2,4,4],[4,7,4,9],[4,12,4,14],[5,2,5,4],[5,7,5,9],[5,12,5,14],[9,0,9,1],[3,12,3,14],[10,2,10,4],[10,7,10,9],[10,12,10,14],[11,2,11,4],[11,7,11,9],[11,12,11,14],[6,2,6,4],[6,7,6,9],[6,12,6,14],[7,12,7,14],[8,2,8,4],[8,7,8,9],[8,12,8,14],[17,2,17,6],[18,2,18,6],[19,2,19,6],[20,2,20,6],[23,0,23,1],[24,2,24,4],[12,2,12,4],[12,7,12,9],[13,2,13,4],[13,7,13,9],[15,2,15,6],[16,2,16,6],[14,8,15,11],[27,7,27,9],[27,12,27,14],[28,2,28,4],[28,7,28,9],[28,12,28,14],[29,0,29,1],[24,7,24,9],[24,12,24,14],[25,2,25,4],[25,7,25,9],[25,12,25,14],[26,2,26,4],[26,7,26,9],[26,12,26,14],[32,2,32,4],[32,7,32,9],[32,16,33,17],[33,2,33,4],[33,7,33,9],[33,12,33,14],[34,12,34,14],[30,2,30,4],[30,7,30,9],[30,12,30,14],[31,2,31,4],[31,7,31,9],[31,12,31,14],[43,0,43,1],[44,2,44,4],[44,7,44,9],[44,12,44,14],[45,2,45,4],[45,7,45,9],[45,12,45,14],[35,2,35,6],[36,2,36,6],[37,2,37,6],[38,2,38,6],[39,2,39,6],[40,2,40,6],[49,0,49,1],[50,2,50,4],[50,7,50,9],[50,12,50,14],[51,2,51,4],[51,7,51,9],[51,12,51,14],[46,2,46,4],[46,7,46,9],[46,12,46,14],[47,7,47,9],[47,12,47,14],[48,2,48,4],[48,7,48,9],[48,12,48,14],[55,2,55,6],[56,2,56,6],[57,2,57,6],[58,2,58,6],[59,2,59,6],[60,2,60,6],[52,2,52,4],[52,7,52,9],[52,16,53,17],[53,2,53,4],[53,7,53,9],[53,12,53,14],[54,12,54,14],[66,2,66,4],[66,7,66,9],[66,12,66,14],[67,7,67,9],[67,12,67,14],[68,2,68,4],[68,7,68,9],[68,12,68,14],[63,0,63,1],[64,2,64,4],[64,7,64,9],[64,12,64,14],[65,2,65,4],[65,7,65,9],[65,12,65,14],[72,2,72,4],[72,7,72,9],[72,16,73,17],[73,2,73,4],[73,7,73,9],[73,12,73,14],[69,0,69,1],[70,2,70,4],[70,7,70,9],[70,12,70,14],[71,2,71,4],[71,7,71,9],[71,12,71,14],[83,0,83,1],[84,2,84,4],[84,7,84,9],[84,12,84,14],[85,2,85,4],[85,7,85,9],[85,12,85,14],[75,2,75,6],[76,2,76,6],[77,2,77,6],[78,2,78,6],[79,2,79,6],[80,2,80,6],[89,0,89,1],[90,2,90,4],[90,7,90,9],[90,12,90,14],[91,2,91,4],[91,7,91,9],[91,12,91,14],[86,2,86,4],[86,7,86,9],[86,12,86,14],[87,7,87,9],[87,12,87,14],[88,2,88,4],[88,7,88,9],[88,12,88,14],[95,2,95,6],[96,2,96,6],[97,2,97,6],[98,2,98,6],[99,2,99,6],[100,2,100,6],[92,2,92,4],[92,7,92,9],[92,16,93,17],[93,2,93,4],[93,7,93,9],[93,12,93,14],[106,2,106,4],[106,7,106,9],[106,12,106,14],[107,7,107,9],[107,12,107,14],[108,2,108,4],[108,7,108,9],[108,12,108,14],[103,0,103,1],[104,2,104,4],[104,7,104,9],[104,12,104,14],[105,2,105,4],[105,7,105,9],[105,12,105,14],[112,2,112,4],[112,7,112,9],[112,16,113,17],[113,2,113,4],[113,7,113,9],[113,12,113,14],[109,0,109,1],[110,2,110,4],[110,7,110,9],[110,12,110,14],[111,2,111,4],[111,7,111,9],[111,12,111,14],[123,0,123,1],[124,2,124,4],[124,7,124,9],[124,12,124,14],[125,2,125,4],[125,7,125,9],[125,12,125,14],[115,2,115,6],[116,2,116,6],[117,2,117,6],[118,2,118,6],[119,2,119,6],[120,2,120,6],[129,0,129,1],[130,2,130,4],[130,7,130,9],[130,12,130,14],[131,2,131,4],[131,7,131,9],[131,12,131,14],[126,2,126,4],[126,7,126,9],[126,12,126,14],[127,7,127,9],[127,12,127,14],[128,2,128,4],[128,7,128,9],[128,12,128,14],[135,2,135,6],[136,2,136,6],[137,2,137,6],[138,2,138,6],[139,2,139,6],[140,2,140,6],[132,2,132,4],[132,7,132,9],[132,16,133,17],[133,2,133,4],[133,7,133,9],[133,12,133,14],[146,2,146,4],[146,7,146,9],[146,12,146,14],[147,7,147,9],[147,12,147,14],[148,2,148,4],[148,7,148,9],[148,12,148,14],[143,0,143,1],[144,2,144,4],[144,7,144,9],[144,12,144,14],[145,2,145,4],[145,7,145,9],[145,12,145,14],[152,2,152,4],[152,7,152,9],[152,16,153,17],[153,2,153,4],[153,7,153,9],[153,12,153,14],[149,0,149,1],[150,2,150,4],[150,7,150,9],[150,12,150,14],[151,2,151,4],[151,7,151,9],[151,12,151,14],[163,0,163,1],[164,2,164,4],[164,7,164,9],[164,12,164,14],[165,2,165,4],[165,7,165,9],[165,12,165,14],[155,2,155,6],[156,2,156,6],[157,2,157,6],[158,2,158,6],[159,2,159,6],[160,2,160,6],[169,0,169,1],[170,2,170,4],[170,7,170,9],[170,12,170,14],[171,2,171,4],[171,7,171,9],[171,12,171,14],[168,2,168,4],[168,7,168,9],[168,12,168,14],[189,0,189,1],[190,2,190,4],[190,7,190,9],[190,12,190,14],[191,2,191,4],[191,7,191,9],[191,12,191,14],[183,0,183,1],[184,2,184,4],[184,7,184,9],[184,12,184,14],[185,2,185,4],[185,7,185,9],[185,12,185,14],[172,2,172,4],[172,7,172,9],[166,2,166,4],[166,7,166,9],[166,12,166,14],[167,7,167,9],[167,12,167,14],[192,16,193,17],[193,2,193,4],[193,7,193,9],[193,12,193,14],[175,2,175,6],[176,2,176,6],[177,2,177,6],[178,2,178,6],[179,2,179,6],[180,2,180,6],[172,16,173,17],[173,2,173,4],[173,7,173,9],[173,12,173,14],[195,2,195,6],[196,2,196,6],[197,2,197,6],[198,2,198,6],[199,2,199,6],[200,2,200,6],[192,2,192,4],[192,7,192,9],[186,2,186,4],[186,7,186,9],[187,7,187,9],[188,2,188,4],[188,7,188,9],[74,12,74,14],[94,12,94,14],[114,12,114,14],[134,12,134,14],[154,12,154,14],[174,12,174,14],[194,12,194,14],[12,12,12,14],[186,12,186,14],[187,12,187,14],[188,12,188,14]]}
["Flexural Maturity Summary"]
[]
["NOTE: IF YOU ARE USING A MATURITY REPORT OLDER THAN v2.5; PLEASE UPDATE TO THE NEWEST VERSION BEFORE USING THIS TAB."]
["Original Curve",null,"C. Barko",null,null,null,null,null,null,null,null,"Version:"]
[null,"Curve #:",null,null,null,null,"Monitor:",null,null,null,null,"Inspector:"]
[null,"Project #:",null,null,null,null,"Concrete Suplier:",null,null,null,null,"Date Valid:"]
[null,"Beam Size:",null,null,null,null,"Plant Location:",null,null,null,null,{"$f":"IF(L8<>\"\",\"\", \"Expiration Date:\")","v":"Expiration Date:"}]
[null,null,null,null,null,null,null,null,null,null,null,{"$f":"IF(M6=\"\",\"\", IF(M7<>\"\",\"\", \"Expiration Date:\"))","v":""},{"$f":"IF(AND(M6<>\"\", M7=\"\"), (M6+90),\"\")","v":""}]
[null,"Mix:",null,null,null,null,"W/C Ratio:",null,null,null,null,"Max W/C on Grade:"]
["Mix Info"]
[null,"Cement:",null,null,null,null,"FlyAsh:",null,null,null,null,"GGBFS:"]
[null,"Coarse Agg:",null,null,null,null,"Intermediate Agg:",null,null,null,null,"Fine Agg:"]
[null,"Water Reducer:",null,null,null,null,"Air:",null,null,null,null,{"$f":"IF('Proj Info'!B71=\"\", \"CO2 ADMIX:\", _xlfn.CONCAT('Proj Info'!B71,\":\"))","v":"CO2 ADMIX:"}]
[null,"Flexural Strength PSI:",null,null,null,null,"TTF to Open:"]
[null,null,null,null,null,null,null,null,"Click Here To Import Your Maturity Curve"]
[null,"Comments:"]
[]
[]
[]
[]
[]
[]
[]
["Validation 1",null,{"$f":"IF(C25=\"\",\"\", IF($C$5<>C25, \"Oops, Something Went Wrong. Please Verify You Imported the Correct Validation\",\"\"))","v":""}]
[null,"Curve #:",null,null,null,null,"Monitor:",null,null,null,null,"Inspector:"]
[null,"Project #:",{"$f":"IF(AND($C$6<>\"\",H29<>\"\"), $C$6,\"\")","v":""},null,null,null,"Concrete Suplier:",{"$f":"IF(AND($H$6<>\"\",H29<>\"\"),$H$6,\"\")","v":""},null,null,null,"Validation Date:"]
[null,"Validation Project #:",null,null,null,null,"Plant Location:",null,null,null,null,{"$f":"IF(L28<>\"\",\"\", \"Expiration Date:\")","v":"Expiration Date:"}]
[null,null,null,null,null,null,"Beam Size:",null,null,null,null,{"$f":"IF(M26=\"\",\"\", IF(M27<>\"\",\"\", \"Expiration Date:\"))","v":""},{"$f":"IF(AND(M26<>\"\", M27=\"\"), (M26+90),\"\")","v":""}]
[null,"Mix:",null,null,null,null,"W/C Ratio:",null,null,null,null,"Max W/C on Grade:"]
["Mix Changes",null,{"$f":"IF(C29=\"\",\"\", IF($C$9<>C29, \"Oops, Something Went Wrong. Please Verify You Imported the Correct Validation\",\"\"))","v":""}]
[null,"Cement:",null,null,null,null,"FlyAsh:",null,null,null,null,"GGBFS:"]
[null,"Coarse Agg:",null,null,null,null,"Intermediate Agg:",null,null,null,null,"Fine Agg:"]
[null,"Water Reducer:",null,null,null,null,"Air:"]
[null,"Flexural Strength PSI:",null,null,null,null,"TTF to Open:",null,null,null,null,"TTF @ Break:"]
[null,null,null,null,null,null,null,null,null,null,null,{"$f":"IF('Proj Info'!B71=\"\", \"CO2 ADMIX:\", _xlfn.CONCAT('Proj Info'!B71,\":\"))","v":"CO2 ADMIX:"}]
[null,"Comments:"]
[]
[]
[]
[]
[]
[]
[]
["Validation 2",null,{"$f":"IF(C45=\"\",\"\", IF($C$5<>C45, \"Oops, Something Went Wrong. Please Verify You Imported the Correct Validation\",\"\"))","v":""}]
[null,"Curve #:",null,null,null,null,"Monitor:",null,null,null,null,"Inspector:"]
[null,"Project #:",{"$f":"IF(AND($C$6<>\"\",H49<>\"\"), $C$6,\"\")","v":""},null,null,null,"Concrete Suplier:",{"$f":"IF(AND($H$6<>\"\",H49<>\"\"),$H$6,\"\")","v":""},null,null,null,"Validation Date:"]
[null,"Validation Project #:",null,null,null,null,"Plant Location:",null,null,null,null,{"$f":"IF(L48<>\"\",\"\", \"Expiration Date:\")","v":"Expiration Date:"}]
[null,null,null,null,null,null,"Beam Size:",null,null,null,null,{"$f":"IF(M46=\"\",\"\", IF(M47<>\"\",\"\", \"Expiration Date:\"))","v":""},{"$f":"IF(AND(M46<>\"\", M47=\"\"), (M46+90),\"\")","v":""}]
[null,"Mix:",null,null,null,null,"W/C Ratio:",null,null,null,null,"Max W/C on Grade:"]
["Mix Changes",null,{"$f":"IF(C49=\"\",\"\", IF($C$9<>C49, \"Oops, Something Went Wrong. Please Verify You Imported the Correct Validation\",\"\"))","v":""}]
[null,"Cement:",null,null,null,null,"FlyAsh:",null,null,null,null,"GGBFS:"]
[null,"Coarse Agg:",null,null,null,null,"Intermediate Agg:",null,null,null,null,"Fine Agg:"]
[null,"Water Reducer:",null,null,null,null,"Air:"]
[null,"Flexural Strength PSI:",null,null,null,null,"TTF to Open:",null,null,null,null,"TTF @ Break:"]
[null,null,null,null,null,null,null,null,null,null,null,{"$f":"IF('Proj Info'!B71=\"\", \"CO2 ADMIX:\", _xlfn.CONCAT('Proj Info'!B71,\":\"))","v":"CO2 ADMIX:"}]
[null,"Comments:"]
[]
[]
[]
[]
[]
[]
[]
["Validation 3",null,{"$f":"IF(C65=\"\",\"\", IF($C$5<>C65, \"Oops, Something Went Wrong. Please Verify You Imported the Correct Validation\",\"\"))","v":""}]
[null,"Curve #:",null,null,null,null,"Monitor:",null,null,null,null,"Inspector:"]
[null,"Project #:",{"$f":"IF(AND($C$6<>\"\",H69<>\"\"), $C$6,\"\")","v":""},null,null,null,"Concrete Suplier:",{"$f":"IF(AND($H$6<>\"\",H69<>\"\"),$H$6,\"\")","v":""},null,null,null,"Validation Date:"]
[null,"Validation Project #:",null,null,null,null,"Plant Location:",null,null,null,null,{"$f":"IF(L68<>\"\",\"\", \"Expiration Date:\")","v":"Expiration Date:"}]
[null,null,null,null,null,null,"Beam Size:",null,null,null,null,{"$f":"IF(M66=\"\",\"\", IF(M67<>\"\",\"\", \"Expiration Date:\"))","v":""},{"$f":"IF(AND(M66<>\"\", M67=\"\"), (M66+90),\"\")","v":""}]
[null,"Mix:",null,null,null,null,"W/C Ratio:",null,null,null,null,"Max W/C on Grade:"]
["Mix Changes",null,{"$f":"IF(C69=\"\",\"\", IF($C$9<>C69, \"Oops, Something Went Wrong. Please Verify You Imported the Correct Validation\",\"\"))","v":""}]
[null,"Cement:",null,null,null,null,"FlyAsh:",null,null,null,null,"GGBFS:"]
[null,"Coarse Agg:",null,null,null,null,"Intermediate Agg:",null,null,null,null,"Fine Agg:"]
[null,"Water Reducer:",null,null,null,null,"Air:"]
[null,"Flexural Strength PSI:",null,null,null,null,"TTF to Open:",null,null,null,null,"TTF @ Break:"]
[null,null,null,null,null,null,null,null,null,null,null,{"$f":"IF('Proj Info'!B71=\"\", \"CO2 ADMIX:\", _xlfn.CONCAT('Proj Info'!B71,\":\"))","v":"CO2 ADMIX:"}]
[null,"Comments:"]
[]
[]
[]
[]
[]
[]
[]
["Validation 4",null,{"$f":"IF(C85=\"\",\"\", IF($C$5<>C85, \"Oops, Something Went Wrong. Please Verify You Imported the Correct Validation\",\"\"))","v":""}]
[null,"Curve #:",null,null,null,null,"Monitor:",null,null,null,null,"Inspector:"]
[null,"Project #:",{"$f":"IF(AND($C$6<>\"\",H89<>\"\"), $C$6,\"\")","v":""},null,null,null,"Concrete Suplier:",{"$f":"IF(AND($H$6<>\"\",H89<>\"\"),$H$6,\"\")","v":""},null,null,null,"Validation Date:"]
[null,"Validation Project #:",null,null,null,null,"Plant Location:",null,null,null,null,{"$f":"IF(L88<>\"\",\"\", \"Expiration Date:\")","v":"Expiration Date:"}]
[null,null,null,null,null,null,"Beam Size:",null,null,null,null,{"$f":"IF(M86=\"\",\"\", IF(M87<>\"\",\"\", \"Expiration Date:\"))","v":""},{"$f":"IF(AND(M86<>\"\", M87=\"\"), (M86+90),\"\")","v":""}]
[null,"Mix:",null,null,null,null,"W/C Ratio:",null,null,null,null,"Max W/C on Grade:"]
["Mix Changes",null,{"$f":"IF(C89=\"\",\"\", IF($C$9<>C89, \"Oops, Something Went Wrong. Please Verify You Imported the Correct Validation\",\"\"))","v":""}]
[null,"Cement:",null,null,null,null,"FlyAsh:",null,null,null,null,"GGBFS:"]
[null,"Coarse Agg:",null,null,null,null,"Intermediate Agg:",null,null,null,null,"Fine Agg:"]
[null,"Water Reducer:",null,null,null,null,"Air:"]
[null,"Flexural Strength PSI:",null,null,null,null,"TTF to Open:",null,null,null,null,"TTF @ Break:"]
[null,null,null,null,null,null,null,null,null,null,null,{"$f":"IF('Proj Info'!B71=\"\", \"CO2 ADMIX:\", _xlfn.CONCAT('Proj Info'!B71,\":\"))","v":"CO2 ADMIX:"}]
[null,"Comments:"]
[]
[]
[]
[]
[]
[]
[]
["Validation 5",null,{"$f":"IF(C105=\"\",\"\", IF($C$5<>C105, \"Oops, Something Went Wrong. Please Verify You Imported the Correct Validation\",\"\"))","v":""}]
[null,"Curve #:",null,null,null,null,"Monitor:",null,null,null,null,"Inspector:"]
[null,"Project #:",{"$f":"IF(AND($C$6<>\"\",H109<>\"\"), $C$6,\"\")","v":""},null,null,null,"Concrete Suplier:",{"$f":"IF(AND($H$6<>\"\",H109<>\"\"),$H$6,\"\")","v":""},null,null,null,"Validation Date:"]
[null,"Validation Project #:",null,null,null,null,"Plant Location:",null,null,null,null,{"$f":"IF(L108<>\"\",\"\", \"Expiration Date:\")","v":"Expiration Date:"}]
[null,null,null,null,null,null,"Beam Size:",null,null,null,null,{"$f":"IF(M106=\"\",\"\", IF(M107<>\"\",\"\", \"Expiration Date:\"))","v":""},{"$f":"IF(AND(M106<>\"\", M107=\"\"), (M106+90),\"\")","v":""}]
[null,"Mix:",null,null,null,null,"W/C Ratio:",null,null,null,null,"Max W/C on Grade:"]
["Mix Changes",null,{"$f":"IF(C109=\"\",\"\", IF($C$9<>C109, \"Oops, Something Went Wrong. Please Verify You Imported the Correct Validation\",\"\"))","v":""}]
[null,"Cement:",null,null,null,null,"FlyAsh:",null,null,null,null,"GGBFS:"]
[null,"Coarse Agg:",null,null,null,null,"Intermediate Agg:",null,null,null,null,"Fine Agg:"]
[null,"Water Reducer:",null,null,null,null,"Air:"]
[null,"Flexural Strength PSI:",null,null,null,null,"TTF to Open:",null,null,null,null,"TTF @ Break:"]
[null,null,null,null,null,null,null,null,null,null,null,{"$f":"IF('Proj Info'!B71=\"\", \"CO2 ADMIX:\", _xlfn.CONCAT('Proj Info'!B71,\":\"))","v":"CO2 ADMIX:"}]
[null,"Comments:"]
[]
[]
[]
[]
[]
[]
[]
["Validation 6",null,{"$f":"IF(C125=\"\",\"\", IF($C$5<>C125, \"Oops, Something Went Wrong. Please Verify You Imported the Correct Validation\",\"\"))","v":""}]
[null,"Curve #:",null,null,null,null,"Monitor:",null,null,null,null,"Inspector:"]
[null,"Project #:",{"$f":"IF(AND($C$6<>\"\",H129<>\"\"), $C$6,\"\")","v":""},null,null,null,"Concrete Suplier:",{"$f":"IF(AND($H$6<>\"\",H129<>\"\"),$H$6,\"\")","v":""},null,null,null,"Validation Date:"]
[null,"Validation Project #:",null,null,null,null,"Plant Location:",null,null,null,null,{"$f":"IF(L128<>\"\",\"\", \"Expiration Date:\")","v":"Expiration Date:"}]
[null,null,null,null,null,null,"Beam Size:",null,null,null,null,{"$f":"IF(M126=\"\",\"\", IF(M127<>\"\",\"\", \"Expiration Date:\"))","v":""},{"$f":"IF(AND(M126<>\"\", M127=\"\"), (M126+90),\"\")","v":""}]
[null,"Mix:",null,null,null,null,"W/C Ratio:",null,null,null,null,"Max W/C on Grade:"]
["Mix Changes",null,{"$f":"IF(C129=\"\",\"\", IF($C$9<>C129, \"Oops, Something Went Wrong. Please Verify You Imported the Correct Validation\",\"\"))","v":""}]
[null,"Cement:",null,null,null,null,"FlyAsh:",null,null,null,null,"GGBFS:"]
[null,"Coarse Agg:",null,null,null,null,"Intermediate Agg:",null,null,null,null,"Fine Agg:"]
[null,"Water Reducer:",null,null,null,null,"Air:"]
[null,"Flexural Strength PSI:",null,null,null,null,"TTF to Open:",null,null,null,null,"TTF @ Break:"]
[null,null,null,null,null,null,null,null,null,null,null,{"$f":"IF('Proj Info'!B71=\"\", \"CO2 ADMIX:\", _xlfn.CONCAT('Proj Info'!B71,\":\"))","v":"CO2 ADMIX:"}]
[null,"Comments:"]
[]
[]
[]
[]
[]
[]
[]
["Validation 7",null,{"$f":"IF(C145=\"\",\"\", IF($C$5<>C145, \"Oops, Something Went Wrong. Please Verify You Imported the Correct Validation\",\"\"))","v":""}]
[null,"Curve #:",null,null,null,null,"Monitor:",null,null,null,null,"Inspector:"]
[null,"Project #:",{"$f":"IF(AND($C$6<>\"\",H149<>\"\"), $C$6,\"\")","v":""},null,null,null,"Concrete Suplier:",{"$f":"IF(AND($H$6<>\"\",H149<>\"\"),$H$6,\"\")","v":""},null,null,null,"Validation Date:"]
[null,"Validation Project #:",null,null,null,null,"Plant Location:",null,null,null,null,{"$f":"IF(L148<>\"\",\"\", \"Expiration Date:\")","v":"Expiration Date:"}]
[null,null,null,null,null,null,"Beam Size:",null,null,null,null,{"$f":"IF(M146=\"\",\"\", IF(M147<>\"\",\"\", \"Expiration Date:\"))","v":""},{"$f":"IF(AND(M146<>\"\", M147=\"\"), (M146+90),\"\")","v":""}]
[null,"Mix:",null,null,null,null,"W/C Ratio:",null,null,null,null,"Max W/C on Grade:"]
["Mix Changes",null,{"$f":"IF(C149=\"\",\"\", IF($C$9<>C149, \"Oops, Something Went Wrong. Please Verify You Imported the Correct Validation\",\"\"))","v":""}]
[null,"Cement:",null,null,null,null,"FlyAsh:",null,null,null,null,"GGBFS:"]
[null,"Coarse Agg:",null,null,null,null,"Intermediate Agg:",null,null,null,null,"Fine Agg:"]
[null,"Water Reducer:",null,null,null,null,"Air:"]
[null,"Flexural Strength PSI:",null,null,null,null,"TTF to Open:",null,null,null,null,"TTF @ Break:"]
[null,null,null,null,null,null,null,null,null,null,null,{"$f":"IF('Proj Info'!B71=\"\", \"CO2 ADMIX:\", _xlfn.CONCAT('Proj Info'!B71,\":\"))","v":"CO2 ADMIX:"}]
[null,"Comments:"]
[]
[]
[]
[]
[]
[]
[]
["Validation 8",null,{"$f":"IF(C165=\"\",\"\", IF($C$5<>C165, \"Oops, Something Went Wrong. Please Verify You Imported the Correct Validation\",\"\"))","v":""}]
[null,"Curve #:",null,null,null,null,"Monitor:",null,null,null,null,"Inspector:"]
[null,"Project #:",{"$f":"IF(AND($C$6<>\"\",H169<>\"\"), $C$6,\"\")","v":""},null,null,null,"Concrete Suplier:",{"$f":"IF(AND($H$6<>\"\",H169<>\"\"),$H$6,\"\")","v":""},null,null,null,"Validation Date:"]
[null,"Validation Project #:",null,null,null,null,"Plant Location:",null,null,null,null,{"$f":"IF(L168<>\"\",\"\", \"Expiration Date:\")","v":"Expiration Date:"}]
[null,null,null,null,null,null,"Beam Size:",null,null,null,null,{"$f":"IF(M166=\"\",\"\", IF(M167<>\"\",\"\", \"Expiration Date:\"))","v":""},{"$f":"IF(AND(M166<>\"\", M167=\"\"), (M166+90),\"\")","v":""}]
[null,"Mix:",null,null,null,null,"W/C Ratio:",null,null,null,null,"Max W/C on Grade:"]
["Mix Changes",null,{"$f":"IF(C169=\"\",\"\", IF($C$9<>C169, \"Oops, Something Went Wrong. Please Verify You Imported the Correct Validation\",\"\"))","v":""}]
[null,"Cement:",null,null,null,null,"FlyAsh:",null,null,null,null,"GGBFS:"]
[null,"Coarse Agg:",null,null,null,null,"Intermediate Agg:",null,null,null,null,"Fine Agg:"]
[null,"Water Reducer:",null,null,null,null,"Air:"]
[null,"Flexural Strength PSI:",null,null,null,null,"TTF to Open:",null,null,null,null,"TTF @ Break:"]
[null,null,null,null,null,null,null,null,null,null,null,{"$f":"IF('Proj Info'!B71=\"\", \"CO2 ADMIX:\", _xlfn.CONCAT('Proj Info'!B71,\":\"))","v":"CO2 ADMIX:"}]
[null,"Comments:"]
[]
[]
[]
[]
[]
[]
[]
["Validation 9",null,{"$f":"IF(C185=\"\",\"\", IF($C$5<>C185, \"Oops, Something Went Wrong. Please Verify You Imported the Correct Validation\",\"\"))","v":""}]
[null,"Curve #:",null,null,null,null,"Monitor:",null,null,null,null,"Inspector:"]
[null,"Project #:",{"$f":"IF(AND($C$6<>\"\",H189<>\"\"), $C$6,\"\")","v":""},null,null,null,"Concrete Suplier:",{"$f":"IF(AND($H$6<>\"\",H189<>\"\"),$H$6,\"\")","v":""},null,null,null,"Validation Date:"]
[null,"Validation Project #:",null,null,null,null,"Plant Location:",null,null,null,null,{"$f":"IF(L188<>\"\",\"\", \"Expiration Date:\")","v":"Expiration Date:"}]
[null,null,null,null,null,null,"Beam Size:",null,null,null,null,{"$f":"IF(M186=\"\",\"\", IF(M187<>\"\",\"\", \"Expiration Date:\"))","v":""},{"$f":"IF(AND(M186<>\"\", M187=\"\"), (M186+90),\"\")","v":""}]
[null,"Mix:",null,null,null,null,"W/C Ratio:",null,null,null,null,"Max W/C on Grade:"]
["Mix Changes",null,{"$f":"IF(C189=\"\",\"\", IF($C$9<>C189, \"Oops, Something Went Wrong. Please Verify You Imported the Correct Validation\",\"\"))","v":""}]
[null,"Cement:",null,null,null,null,"FlyAsh:",null,null,null,null,"GGBFS:"]
[null,"Coarse Agg:",null,null,null,null,"Intermediate Agg:",null,null,null,null,"Fine Agg:"]
[null,"Water Reducer:",null,null,null,null,"Air:"]
[null,"Flexural Strength PSI:",null,null,null,null,"TTF to Open:",null,null,null,null,"TTF @ Break:"]
[null,null,null,null,null,null,null,null,null,null,null,{"$f":"IF('Proj Info'!B71=\"\", \"CO2 ADMIX:\", _xlfn.CONCAT('Proj Info'!B71,\":\"))","v":"CO2 ADMIX:"}]
[null,"Comments:"]

{"sheet":"Report ","index":13,"n_rows":48,"n_cols":37,"rows_kept":48,"cut":false,"hidden":false,"merged":[[1,31,4,38],[0,3,0,22],[2,21,2,22],[3,21,3,22],[1,20,1,22],[1,3,1,4],[36,2,36,13],[18,14,18,15],[22,14,22,15],[33,20,33,23],[34,20,34,23],[36,20,36,23],[35,20,35,23],[31,22,31,23],[31,18,31,20],[25,18,25,20],[26,18,26,20],[27,18,27,20],[28,18,28,20],[29,18,29,20],[30,18,30,20],[18,19,18,24],[47,16,47,19],[38,18,38,22],[39,18,39,22],[40,18,40,22],[41,18,41,22],[43,2,43,17],[46,2,46,12],[45,2,45,12],[45,16,45,19],[44,2,44,12],[44,16,44,19],[46,16,46,19],[19,19,20,19],[30,22,30,23],[25,22,25,23],[26,22,26,23],[27,22,27,23],[28,22,28,23],[29,22,29,23]]}
[null,"800240 computer",{"$f":"Menu!D1","v":"v12.0"},"PCC Plant Report",null,null,null,null,null,null,null,null,null,null,null,null,null,null,null,null,null,null,null,{"$f":"IF('Proj Info'!$B$1=\"M\",\"M - Units\",\"E - Units\")","v":"E - Units"},null,"yd3","m3"]
[null,null,"C. Barko","Location",null,null,null,{"$f":"IF(AND(B13<>\"\", OR(H3=\"\",M3=\"\",R3=\"\",H4=\"\",M4=\"\",R4=\"\",H5=\"\")), \"Please fill in the highlighted information\",\"\")","v":""},null,null,null,null,null,null,null,null,null,null,"Plant Type ( x )",null,"Placement Type",null,null,"Report","SEND","lbs/yd3","kgs/m3",null,null,null,null,"Please submit plant reoprt in Excel format."]
[null,"Date of Placement",null,"From","To",null,"Project No.: ",{"$f":"IF('Proj Info'!B8=\"\",\"\",'Proj Info'!B8)","v":""},null,null,null,"Contract ID: ",{"$f":"IF('Proj Info'!B13=\"\",\"\",('Proj Info'!B13))","v":""},null,null,null,"Report No.: ",{"$f":"IF('Proj Info'!B2=\"\",\"\", IF('Proj Info'!C2=\"\",'Proj Info'!B2, _xlfn.CONCAT('Proj Info'!B2,\" \",'Proj Info'!C2)))","v":""},"Central",{"$f":"IF('Proj Info'!$B$25=\" \",\" \",'Proj Info'!$B$25)","v":" "},{"$f":"IF('Proj Info'!B27=\"\",\"\", \"Paving\")","v":""},{"$f":"IF('Proj Info'!B28=\"\",\"\",'Proj Info'!B28)","v":""},null,{"$f":"IF(OR(V3=\"Continous\", V4=\"Bridge Deck\"), \"X\",\"\")","v":""}," (Daily)","lbs","kgs"]
[null,"Mix 1",{"$f":"IF('Mix Info'!B3=\"\",\"\",IF('Mix Info'!B2=\"FM\",\"\",IF('Mix Info'!B2=\"GR\",\"\",'Mix Info'!B3)))","v":""},null,null,null,"Plant Name: ",{"$f":"IF('Proj Info'!B10=\"\",\"\",('Proj Info'!B10))","v":""},null,null,null,"County: ",{"$f":"IF('Proj Info'!B14=\"\",\"\",('Proj Info'!B14))","v":""},null,null,null,"Date This Report: ",{"$f":"IF('Proj Info'!B3=\"\",\"\",('Proj Info'!B3))","v":""},"Ready",{"$f":"IF('Proj Info'!$B$26=\" \",\" \",'Proj Info'!$B$26)","v":" "},{"$f":"IF('Proj Info'!B29=\"\",\"\", \"Structural\")","v":""},{"$f":"IF('Proj Info'!B30=\"\",\"\",'Proj Info'!B30)","v":""},null,{"$f":"IF(OR(V3=\"Intermittent\", V3=\"Low\", V4=\"Other\"), \"X\", \"\")","v":""},{"$f":"IF(V4=\"Other\", \" (Lot)\", \" (Weekly)\")","v":" (Weekly)"},"ºF","ºC"]
[null,"Mix 2",{"$f":"IF('Mix Info'!C3=\"\",\"\",IF('Mix Info'!C2=\"FM\",\"\",(IF('Mix Info'!C2=\"GR\",\"\",'Mix Info'!C3))))","v":""},null,null,null,"Contractor: ",{"$f":"IF('Proj Info'!B11=\"\",\"\",('Proj Info'!B11))","v":""},null,null,null,"Temp. Min: ",{"$f":"IF('Proj Info'!B6=\"\",\"\",('Proj Info'!B6))","v":""},{"$f":"IF('Proj Info'!$B$1=\"M\",'Report '!$AA$4,'Report '!$Z$4)","v":"ºF"},null,null,"Date Of Last Report: ",{"$f":"IF('Proj Info'!B4=\"\",\"\",('Proj Info'!B4))","v":""},null,null,null,null,"Non-structural",{"$f":"IF('Proj Info'!$B$31=\" \",\" \",'Proj Info'!$B$31)","v":" "}," (Monthly)","tons","Mg's"]
[null,"Mix 3",{"$f":"IF('Mix Info'!D3=\"\",\"\",IF('Mix Info'!D2=\"FM\",\"\",(IF('Mix Info'!D2=\"GR\",\"\",'Mix Info'!D3))))","v":""},null,null,null,"SubContractor: ",{"$f":"IF('Proj Info'!B12=\"\",\"\",('Proj Info'!B12))","v":""},null,null,null,"Temp. Max: ",{"$f":"IF('Proj Info'!B7=\"\",\"\",('Proj Info'!B7))","v":""},{"$f":"IF('Proj Info'!$B$1=\"M\",'Report '!$AA$4,'Report '!$Z$4)","v":"ºF"},null,null,"Structures Des. No: ",{"$f":"IF('Proj Info'!B15=\"\",\"\",('Proj Info'!B15))","v":""},null,null,null,null,"Miscellaneous",{"$f":"IF('Proj Info'!$B$32=\" \",\" \",'Proj Info'!$B$32)","v":" "}," (Project)","1  1/2\"","37.5mm"]
[null,"Mix 4",{"$f":"IF('Mix Info'!E3=\"\",\"\",IF('Mix Info'!E2=\"FM\",\"\",(IF('Mix Info'!E2=\"GR\",\"\",'Mix Info'!E3))))","v":""},null,null,null,"Weather: ",{"$f":"IF('Proj Info'!B5=\"\",\"\",('Proj Info'!B5))","v":""},null,null,null,"Maturity Mix ID: ",{"$f":"IF('Proj Info'!B17=\"\",\"\",('Proj Info'!B17))","v":""},null,null,null,"Curve / Validation Date: ",{"$f":"IF('Proj Info'!B21=\"\",\"\",('Proj Info'!B21))","v":""},{"$f":"IF(OR(AND(C4>R7+90, B13=M7, M7<>\"\"),AND(C5>R7+90, B14=M7,M7<>\"\"), AND(C6>R7+90, B15=M7, M7<>\"\"), AND(C7>R7+90,B16=M7,M7<>\"\"), AND(C8>R7+90, B17=M7,M7<>\"\")), \">90 Days\", IF(OR(AND(C4>R7+30, B13=M7, M7<>\"\", M9=\"Compressive\"),AND(C5>R7+30, B14=M7,M7<>\"\", M9=\"Compressive\"), AND(C6>R7+30, B15=M7, M7<>\"\", M9=\"Compressive\"), AND(C7>R7+30,B16=M7,M7<>\"\", M9=\"Compressive\"), AND(C8>R7+30, B17=M7,M7<>\"\", M9=\"Compressive\")), \">30 Days\",\"\"))","v":""},null,null,null,null,null,null,"1\"","25mm"]
[null,"Mix 5",{"$f":"IF('Mix Info'!F3=\"\",\"\",IF('Mix Info'!F2=\"FM\",\"\",(IF('Mix Info'!F2=\"GR\",\"\",'Mix Info'!F3))))","v":""},null,null,null,"Maturity?:  ",{"$f":"IF('Proj Info'!B16=\"\",\"\",'Proj Info'!B16)","v":""},"Curve #:",{"$f":"IF('Proj Info'!B20=\"\",\"\",('Proj Info'!B20))","v":""},null,"Curve Strength: ",{"$f":"IF('Proj Info'!B19=\"\",\"\",('Proj Info'!B19))","v":""},null,null,null,"Curve Expiration Date: ",{"$f":"IF('Proj Info'!B22=\"\",\"\",'Proj Info'!B22)","v":""},null,null,null,null,"Max On Grade W/C Ratio: ",{"$f":"IF('Proj Info'!B24=\"\",\"\",('Proj Info'!B24))","v":""},null,"3/4\"","19mm"]
[null,null,null,null,null,null,null,null,null,null,null,"Curve Type: ",{"$f":"IF('Proj Info'!B18=\"\",\"\",'Proj Info'!B18)","v":""},null,null,null,"TTF: ",{"$f":"IF('Proj Info'!B23=\"\",\"\",('Proj Info'!B23))","v":""},null,null,{"$f":"IF(AND(H8<>\"\",M7=B13,X13>X8), \"IM 383-The W/C Ratio is out of spec\",IF(AND(H8<>\"\",M7=B14,X14>X8),\"IM 383-The W/C Ratio is out of spec\",IF(AND(H8<>\"\",M7=B15,X15>X8), \"IM 383-The W/C Ratio is out of spec\",IF(AND(H8<>\"\",M7=B16,X16>X8), \"IM 383-The W/C Ratio is out of spec\",IF(AND(H8<>\"\",M7=B17,X17>X8), \"IM 383-The W/C Ratio is out of spec\",\"\")))))","v":""},null,null,null,null,"1/2\"","12.5mm"]
[null,null,null,null,null,"Fine Aggregate",null,null,"Intermediate  Aggregate",null,null,"Coarse Aggregate",null,null,null,null,"      Actual Quantities Used -",null,null,{"$f":"IF('Proj Info'!$B$1=\"M\",'Report '!$AA$2,'Report '!$Z$2)","v":"lbs/yd3"},null,null,null,"Avg","Max",null,"3/8\"","9.5mm"]
[null,"Mix","Batched","% Of Est.","Waste","Moist.","T-203","Wt. SSD","Moist.","T-203","Wt. SSD","Moist.","T-203","Wt. SSD",null,null,null,null,null,null,"Water",null,null,"w/c","w/c",null,"#4","4.75mm"]
[null,null,{"$f":"IF('Proj Info'!$B$1=\"M\",'Report '!$AA$1,'Report '!$Z$1)","v":"yd3"},"Used","yd3","(%)","Sp. G.",{"$f":"IF('Proj Info'!$B$1=\"M\",'Report '!$AA$3,'Report '!$Z$3)","v":"lbs"},"(%)","Sp. G.",{"$f":"IF('Proj Info'!$B$1=\"M\",'Report '!$AA$3,'Report '!$Z$3)","v":"lbs"},"(%)","Sp. G.",{"$f":"IF('Proj Info'!$B$1=\"M\",'Report '!$AA$3,'Report '!$Z$3)","v":"lbs"},"Cement","Fly Ash","GGBFS","Fine","Inter.","Coarse","In Agg.","Plant","Grade","Ratio"," Ratio",null,"#8","2.38mm"]
[1,{"$f":"IF('Mix Info'!$B$2=\"\",\"\",IF('Mix Info'!$B$2=\"FM\",\"\",IF('Mix Info'!$B$2=\"GR\",\"\",('Mix Info'!$B$24))))","v":""},{"$f":"IF($B$13=\"\",\"\",IF('Proj Info'!$B$1=\"M\",'Mix Info'!$B$19*0.76455486,'Mix Info'!$B$19))","v":""},{"$f":"IF($B$13=\"\",\"\",'Mix Info'!$B$20)","v":""},{"$f":"IF($B$13=\"\",\"\",IF('Proj Info'!$B$1=\"M\",'Mix Info'!$B$21*0.76455486,'Mix Info'!$B$21))","v":""},{"$f":"IF($B$13=\"\",\"\",'Mix Info'!$B$14)","v":""},{"$f":"IF($B$13=\"\",\"\",'Mix Info'!$B$11)","v":""},{"$f":"IF(E820150A!$B$38=\"\",\"\",E820150A!$B$38)","v":""},{"$f":"IF(E820150A!$B$39=\"\",\"\",'Mix Info'!$B$15)","v":""},{"$f":"IF(E820150A!$B$39=\"\",\"\",'Mix Info'!$B$12)","v":""},{"$f":"IF(E820150A!$B$39=\"\",\"\",E820150A!$B$39)","v":""},{"$f":"IF('Mix Info'!$B$16=\"\",\"\",'Mix Info'!$B$16)","v":""},{"$f":"IF('Mix Info'!$B$13=\"\",\"\",'Mix Info'!$B$13)","v":""},{"$f":"IF(E820150A!$B$40=\"\",\"\",E820150A!$B$40)","v":""},{"$f":"IF(E820150A!$B$34=\"\",\"\",E820150A!$B$34)","v":""},{"$f":"IF(E820150A!$B$35=0,\"\",E820150A!$B$35)","v":""},{"$f":"IF(E820150A!$B$36=\"\",\"\",E820150A!$B$36)","v":""},{"$f":"IF(H13=\"\",\"\",(H13/(1-F13/100)))","v":""},{"$f":"IF(K13=\"\",\"\",(K13/(1-I13/100)))","v":""},{"$f":"IF(N13=\"\",\"\",(N13/(1-L13/100)))","v":""},{"$f":"IF($H13=\"\",\"\",($R13-$H13)+($S13-$K13)+($T13-$N13))","v":""},{"$f":"IF($B$13=\"\",\"\",IF('Mix Info'!$B$22=\"\",\"\",IF('Proj Info'!$B$1=\"M\",'Mix Info'!$B$22*0.5935,'Mix Info'!$B$22)))","v":""},{"$f":"IF('Mix Info'!$B$23=\"\",\"0.0\",IF('Proj Info'!$B$1=\"M\",'Mix Info'!$B$23*0.5935,'Mix Info'!$B$23))","v":"0.0"},{"$f":"IF(V13=\"\",\"\",(U13+V13+W13)/(O13+P13+Q13))","v":""},{"$f":"IF(B13=\"\",\"\",IF('Mix Info'!B26<>\"\", 0.45,VLOOKUP(Z13,E820150A!$B$35:$G$110,6,FALSE)))","v":""},{"$f":"IF('Mix Info'!B2=\"\",\"\",'Mix Info'!B2)","v":""},"#16","1.16mm",null,null,null,null,null,null,null,null,{"$f":"IF('Mix Info'!B2=\"O-4WR\", \"\", IF('Report '!X13>'Report '!Y13, \"N\",\"\"))","v":""}]
[2,{"$f":"IF('Mix Info'!$C$2=\"\",\"\",IF('Mix Info'!$C$2=\"FM\",\"\",IF('Mix Info'!$C$2=\"GR\",\"\",('Mix Info'!$C$24))))","v":""},{"$f":"IF($B$14=\"\",\"\",IF('Proj Info'!$B$1=\"M\",'Mix Info'!$C$19*0.76455486,'Mix Info'!$C$19))","v":""},{"$f":"IF($B$14=\"\",\"\",'Mix Info'!$C$20)","v":""},{"$f":"IF($B$14=\"\",\"\",IF('Proj Info'!$B$1=\"M\",'Mix Info'!$C$21*0.76455486,'Mix Info'!$C$21))","v":""},{"$f":"IF($B$14=\"\",\"\",'Mix Info'!$C$14)","v":""},{"$f":"IF($B$14=\"\",\"\",'Mix Info'!$C$11)","v":""},{"$f":"IF(E820150A!$C$38=\"\",\"\",E820150A!$C$38)","v":""},{"$f":"IF(E820150A!$C$39=\"\",\"\",'Mix Info'!$C$15)","v":""},{"$f":"IF(E820150A!$C$39=\"\",\"\",'Mix Info'!$C$12)","v":""},{"$f":"IF(E820150A!$C$39=\"\",\"\",E820150A!$C$39)","v":""},{"$f":"IF('Mix Info'!$C$16=\"\",\"\",'Mix Info'!$C$16)","v":""},{"$f":"IF('Mix Info'!$C$13=\"\",\"\",'Mix Info'!$C$13)","v":""},{"$f":"IF(E820150A!$C$40=\"\",\"\",E820150A!$C$40)","v":""},{"$f":"IF(E820150A!$C$34=\"\",\"\",E820150A!$C$34)","v":""},{"$f":"IF(E820150A!$C$35=\"\",\"\",E820150A!$C$35)","v":""},{"$f":"IF(E820150A!$C$36=\"\",\"\",E820150A!$C$36)","v":""},{"$f":"IF(H14=\"\",\"\",(H14/(1-F14/100)))","v":""},{"$f":"IF(K14=\"\",\"\",(K14/(1-I14/100)))","v":""},{"$f":"IF(N14=\"\",\"\",(N14/(1-L14/100)))","v":""},{"$f":"IF($H14=\"\",\"\",($R14-$H14)+($S14-$K14)+($T14-$N14))","v":""},{"$f":"IF($B$14=\"\",\"\",IF('Mix Info'!$C$22=\"\",\"\",IF('Proj Info'!$B$1=\"M\",'Mix Info'!$C$22*0.5935,'Mix Info'!$C$22)))","v":""},{"$f":"IF('Mix Info'!$C$23=\"\",\"0.0\",IF('Proj Info'!$B$1=\"M\",'Mix Info'!$C$23*0.5935,'Mix Info'!$C$23))","v":"0.0"},{"$f":"IF(V14=\"\",\"\",(U14+V14+W14)/(O14+P14+Q14))","v":""},{"$f":"IF(B14=\"\",\"\",IF('Mix Info'!C26<>\"\", 0.45,VLOOKUP(Z14,E820150A!$B$35:$G$110,6,FALSE)))","v":""},{"$f":"IF('Mix Info'!C2=\"\",\"\",'Mix Info'!C2)","v":""},"#30","600µm",null,null,null,null,null,null,null,null,{"$f":"IF('Mix Info'!C2=\"O-4WR\", \"\", IF('Report '!X14>'Report '!Y14, \"N\",\"\"))","v":""}]
[3,{"$f":"IF('Mix Info'!$D$2=\"\",\"\",IF('Mix Info'!$D$2=\"FM\",\"\",IF('Mix Info'!$D$2=\"GR\",\"\",('Mix Info'!$D$24))))","v":""},{"$f":"IF($B$15=\"\",\"\",IF('Proj Info'!$B$1=\"M\",'Mix Info'!$D$19*0.76455486,'Mix Info'!$D$19))","v":""},{"$f":"IF($B$15=\"\",\"\",'Mix Info'!$D$20)","v":""},{"$f":"IF($B$15=\"\",\"\",IF('Proj Info'!$B$1=\"M\",'Mix Info'!$D$21*0.76455486,'Mix Info'!$D$21))","v":""},{"$f":"IF($B$15=\"\",\"\",'Mix Info'!$D$14)","v":""},{"$f":"IF($B$15=\"\",\"\",'Mix Info'!$D$11)","v":""},{"$f":"IF(E820150A!$D$38=\"\",\"\",E820150A!$D$38)","v":""},{"$f":"IF(E820150A!$D$39=\"\",\"\",'Mix Info'!$D$15)","v":""},{"$f":"IF(E820150A!$D$39=\"\",\"\",'Mix Info'!$D12)","v":""},{"$f":"IF(E820150A!$D$39=\"\",\"\",E820150A!$D$39)","v":""},{"$f":"IF('Mix Info'!$D$16=\"\",\"\",'Mix Info'!$D$16)","v":""},{"$f":"IF('Mix Info'!$D$13=\"\",\"\",'Mix Info'!$D$13)","v":""},{"$f":"IF(E820150A!$D$40=\"\",\"\",E820150A!$D$40)","v":""},{"$f":"IF(E820150A!$D$34=\"\",\"\",E820150A!$D$34)","v":""},{"$f":"IF(E820150A!$D$35=\"\",\"\",E820150A!$D$35)","v":""},{"$f":"IF(E820150A!$D$36=\"\",\"\",E820150A!$D$36)","v":""},{"$f":"IF(H15=\"\",\"\",(H15/(1-F15/100)))","v":""},{"$f":"IF(K15=\"\",\"\",(K15/(1-I15/100)))","v":""},{"$f":"IF(N15=\"\",\"\",(N15/(1-L15/100)))","v":""},{"$f":"IF($H15=\"\",\"\",($R15-$H15)+($S15-$K15)+($T15-$N15))","v":""},{"$f":"IF($B$15=\"\",\"\",IF('Mix Info'!$D$22=\"\",\"\",IF('Proj Info'!$B$1=\"M\",'Mix Info'!$D$22*0.5935,'Mix Info'!$D$22)))","v":""},{"$f":"IF('Mix Info'!$D$23=\"\",\"0.0\",IF('Proj Info'!$B$1=\"M\",'Mix Info'!$D$23*0.5935,'Mix Info'!$D$23))","v":"0.0"},{"$f":"IF(V15=\"\",\"\",(U15+V15+W15)/(O15+P15+Q15))","v":""},{"$f":"IF(B15=\"\",\"\",IF('Mix Info'!D26<>\"\", 0.45,VLOOKUP(Z15,E820150A!$B$35:$G$110,6,FALSE)))","v":""},{"$f":"IF('Mix Info'!D2=\"\",\"\",'Mix Info'!D2)","v":""},"#50","300µm",null,null,null,null,null,null,null,null,{"$f":"IF('Mix Info'!D2=\"O-4WR\", \"\", IF('Report '!X15>'Report '!Y15, \"N\",\"\"))","v":""}]
[4,{"$f":"IF('Mix Info'!$E$2=\"\",\"\",IF('Mix Info'!$E$2=\"FM\",\"\",IF('Mix Info'!$E$2=\"GR\",\"\",('Mix Info'!$E$24))))","v":""},{"$f":"IF($B$16=\"\",\"\",IF('Proj Info'!$B$1=\"M\",'Mix Info'!$E$19*0.76455486,'Mix Info'!$E$19))","v":""},{"$f":"IF($B$16=\"\",\"\",'Mix Info'!$E$20)","v":""},{"$f":"IF($B$16=\"\",\"\",IF('Proj Info'!$B$1=\"M\",'Mix Info'!$E$21*0.76455486,'Mix Info'!$E$21))","v":""},{"$f":"IF($B$16=\"\",\"\",'Mix Info'!$E$14)","v":""},{"$f":"IF($B$16=\"\",\"\",'Mix Info'!$E$11)","v":""},{"$f":"IF(E820150A!$E$38=\"\",\"\",E820150A!$E$38)","v":""},{"$f":"IF(E820150A!$E$39=\"\",\"\",'Mix Info'!$E$15)","v":""},{"$f":"IF(E820150A!$E$39=\"\",\"\",'Mix Info'!$E$12)","v":""},{"$f":"IF(E820150A!$E$39=\"\",\"\",E820150A!$E$39)","v":""},{"$f":"IF('Mix Info'!$E$16=\"\",\"\",'Mix Info'!$E$16)","v":""},{"$f":"IF('Mix Info'!$E$13=\"\",\"\",'Mix Info'!$E$13)","v":""},{"$f":"IF(E820150A!$E$40=\"\",\"\",E820150A!$E$40)","v":""},{"$f":"IF(E820150A!$E$34=\"\",\"\",E820150A!$E$34)","v":""},{"$f":"IF(E820150A!$E$35=\"\",\"\",E820150A!$E$35)","v":""},{"$f":"IF(E820150A!$E$36=\"\",\"\",E820150A!$E$36)","v":""},{"$f":"IF(H16=\"\",\"\",(H16/(1-F16/100)))","v":""},{"$f":"IF(K16=\"\",\"\",(K16/(1-I16/100)))","v":""},{"$f":"IF(N16=\"\",\"\",(N16/(1-L16/100)))","v":""},{"$f":"IF($H16=\"\",\"\",($R16-$H16)+($S16-$K16)+($T16-$N16))","v":""},{"$f":"IF($B$16=\"\",\"\",IF('Mix Info'!$E$22=\"\",\"\",IF('Proj Info'!$B$1=\"M\",'Mix Info'!$E$22*0.5935,'Mix Info'!$E$22)))","v":""},{"$f":"IF('Mix Info'!$E$23=\"\",\"0.0\",IF('Proj Info'!$B$1=\"M\",'Mix Info'!$E$23*0.5935,'Mix Info'!$E$23))","v":"0.0"},{"$f":"IF(V16=\"\",\"\",(U16+V16+W16)/(O16+P16+Q16))","v":""},{"$f":"IF(B16=\"\",\"\",IF('Mix Info'!E26<>\"\", 0.45,VLOOKUP(Z16,E820150A!$B$35:$G$110,6,FALSE)))","v":""},{"$f":"IF('Mix Info'!E2=\"\",\"\",'Mix Info'!E2)","v":""},"#100","150µm",null,null,{"$f":"IF(B13=\"\", \"\", IF(U21=\"X\", (U22+W22), (V22+W22)))","v":""},{"$f":"IF(B13=\"\",\"\", (X22+Y22))","v":""},null,null,null,null,{"$f":"IF('Mix Info'!E2=\"O-4WR\", \"\", IF('Report '!X16>'Report '!Y16, \"N\",\"\"))","v":""}]
[5,{"$f":"IF('Mix Info'!$F$2=\"\",\"\",IF('Mix Info'!$F$2=\"FM\",\"\",IF('Mix Info'!$F$2=\"GR\",\"\",('Mix Info'!$F$24))))","v":""},{"$f":"IF($B$17=\"\",\"\",IF('Proj Info'!$B$1=\"M\",'Mix Info'!$F$19*0.76455486,'Mix Info'!$F$19))","v":""},{"$f":"IF($B$17=\"\",\"\",'Mix Info'!$F$20)","v":""},{"$f":"IF($B$17=\"\",\"\",IF('Proj Info'!$B$1=\"M\",'Mix Info'!$F$21*0.76455486,'Mix Info'!$F$21))","v":""},{"$f":"IF($B$17=\"\",\"\",'Mix Info'!$F$14)","v":""},{"$f":"IF($B$17=\"\",\"\",'Mix Info'!$F$11)","v":""},{"$f":"IF(E820150A!$F$38=\"\",\"\",E820150A!$F$38)","v":""},{"$f":"IF(E820150A!$F$39=\"\",\"\",'Mix Info'!$F$15)","v":""},{"$f":"IF(E820150A!$F$39=\"\",\"\",'Mix Info'!$F$12)","v":""},{"$f":"IF(E820150A!$F$39=\"\",\"\",E820150A!$F$39)","v":""},{"$f":"IF('Mix Info'!$F$16=\"\",\"\",'Mix Info'!$F$16)","v":""},{"$f":"IF('Mix Info'!$F$13=\"\",\"\",'Mix Info'!$F$13)","v":""},{"$f":"IF(E820150A!$F$40=\"\",\"\",E820150A!$F$40)","v":""},{"$f":"IF(E820150A!$F$34=\"\",\"\",E820150A!$F$34)","v":""},{"$f":"IF(E820150A!$F$35=\"\",\"\",E820150A!$F$35)","v":""},{"$f":"IF(E820150A!$F$36=\"\",\"\",E820150A!$F$36)","v":""},{"$f":"IF(H17=\"\",\"\",(H17/(1-F17/100)))","v":""},{"$f":"IF(K17=\"\",\"\",(K17/(1-I17/100)))","v":""},{"$f":"IF(N17=\"\",\"\",(N17/(1-L17/100)))","v":""},{"$f":"IF($H17=\"\",\"\",($R17-$H17)+($S17-$K17)+($T17-$N17))","v":""},{"$f":"IF($B$17=\"\",\"\",IF('Mix Info'!$F$22=\"\",\"\",IF('Proj Info'!$B$1=\"M\",'Mix Info'!$F$22*0.5935,'Mix Info'!$F$22)))","v":""},{"$f":"IF('Mix Info'!$F$23=\"\",\"0.0\",IF('Proj Info'!$B$1=\"M\",'Mix Info'!$F$23*0.5935,'Mix Info'!$F$23))","v":"0.0"},{"$f":"IF(V17=\"\",\"\",(U17+V17+W17)/(O17+P17+Q17))","v":""},{"$f":"IF(B17=\"\",\"\",IF('Mix Info'!F26<>\"\", 0.45,VLOOKUP(Z17,E820150A!$B$35:$G$110,6,FALSE)))","v":""},{"$f":"IF('Mix Info'!F2=\"\",\"\",'Mix Info'!F2)","v":""},"#200","75µm",null,null,{"$f":"IF(B13=\"\",\"\", IF(U21=\"X\", (U23+W23), (V23+W23)))","v":""},null,null,null,null,null,{"$f":"IF('Mix Info'!F2=\"O-4WR\", \"\", IF('Report '!X17>'Report '!Y17, \"N\",\"\"))","v":""}]
[null,null,{"$f":"IF(OR('Grad 1'!B41<>\"\", 'Grad 2'!B41<>\"\",'Grad 3'!B41<>\"\"), \"\",IF(AND(SUM(C13:C17)>10, OR('Grad 1'!B41=\"\",'Grad 2'!B41=\"\",'Grad 3'!B41=\"\"),X4=\"x\"), \">10 Cubic Yards Batched, Gradation Required\",\"\"))","v":""},null,null,null,null,null,null,null,{"$f":"IF('Mix Info'!G11=\"\",\"\", \"Enter The Aggregate Percentages On The Mix Info Tab\")","v":""},null,null,null,null,null,null,{"$f":"IF(AK13=\"N\", \"IM 529 Proportion Table 1-The water cement ratio is out of spec\", IF(AK14=\"N\", \"IM 529 Proportion Table 1-The water cement ratio is out of spec\", IF(AK15=\"N\",\"IM 529 Proportion Table 1-The water cement ratio is out of spec\", IF(AK16=\"N\",\"IM 529 Proportion Table 1-The water cement ratio is out of spec\", IF(AK17=\"N\", \"IM 529 Proportion Table 1-The water cement ratio is out of spec\",\"\")))))","v":""},null,null,null,null,null,null,null,{"$f":"IF('Proj Info'!B1=\"M\",1000,2000)","v":2000}]
[null,null,"Coarse",null,{"$f":"IF('Proj Info'!$B$1=\"M\",'Report '!$AA$6,'Report '!$Z$6)","v":"1  1/2\""},{"$f":"IF('Proj Info'!$B$1=\"M\",'Report '!$AA$7,'Report '!$Z$7)","v":"1\""},{"$f":"IF('Proj Info'!$B$1=\"M\",'Report '!$AA$8,'Report '!$Z$8)","v":"3/4\""},{"$f":"IF('Proj Info'!$B$1=\"M\",'Report '!$AA$9,'Report '!$Z$9)","v":"1/2\""},{"$f":"IF('Proj Info'!$B$1=\"M\",'Report '!$AB$10,'Report '!$AA$10)","v":"3/8\""},{"$f":"IF('Proj Info'!$B$1=\"M\",'Report '!$AB$11,'Report '!$AA$11)","v":"#4"},{"$f":"IF('Proj Info'!$B$1=\"M\",'Report '!$AB$12,'Report '!$AA$12)","v":"#8"},{"$f":"IF('Proj Info'!$B$1=\"M\",'Report '!$AB$17,'Report '!$AA$17)","v":"#200"},"Comply",null,"Conc. Treatment",null,"(X)",{"$f":"IF('Proj Info'!$B$1=\"M\",'Report '!$AA$2,'Report '!$Z$2)","v":"lbs/yd3"},null,"Batched"]
[null,"Sample Date:",{"$f":"IF(AND('Mix Info'!H4<>\"\",'Mix Info'!H5<>\"\"),'Mix Info'!H5,\"\")","v":""},null,{"$f":"IF('Proj Info'!$B$90=\" \",\" \",'Proj Info'!$B$90)","v":""},{"$f":"IF('Proj Info'!$B$91=\" \",\" \",'Proj Info'!$B$91)","v":""},{"$f":"IF('Proj Info'!$B$92=\" \",\" \",'Proj Info'!$B$92)","v":""},{"$f":"IF('Proj Info'!$B$93=\" \",\" \",'Proj Info'!$B$93)","v":""},{"$f":"IF('Proj Info'!$B$94=\" \",\" \",'Proj Info'!$B$94)","v":""},{"$f":"IF('Proj Info'!$B$95=\" \",\" \",'Proj Info'!$B$95)","v":""},{"$f":"IF('Proj Info'!$B$96=\" \",\" \",'Proj Info'!$B$96)","v":""},{"$f":"IF('Proj Info'!$B$97=\"\",\"\",'Proj Info'!$B$97)","v":"0-2.5"},"Y/N",null,"           Ice ",null,{"$f":"IF('Proj Info'!$B$73=\"\",\"\",\"X\")","v":""},{"$f":"IF('Proj Info'!$B$74=\"\",\"\",IF('Proj Info'!$B$1=\"M\",('Proj Info'!$B$74*0.5935),'Proj Info'!$B$74))","v":""},null,"Check One (X)",{"$f":"IF(X3=\"X\", \"Daily\",\"\")","v":""},{"$f":"IF(AND(X4=\"X\", Y4=\" (Lot)\"), \"Lot\", IF(X4=\"X\", \"Week\", IF(X5=\"X\", \"Monthly\", IF(X6=\"X\", \"Project\", \"\"))))","v":""},"Total","Waste","Waste"]
[null,{"$f":"IF('Grad 1'!B3=\"\",\"\",'Grad 1'!B3)","v":""},null,{"$f":"IF('Grad 1'!$B$2=\" \",\" \",'Grad 1'!$B$2)","v":" "},{"$f":"IF('Grad 1'!$I$5=\" \",\" \",'Grad 1'!$I$5)","v":" "},{"$f":"IF('Grad 1'!$I$6=\" \",\" \",'Grad 1'!$I$6)","v":" "},{"$f":"IF('Grad 1'!$I$7=\" \",\" \",'Grad 1'!$I$7)","v":" "},{"$f":"IF('Grad 1'!$I$8=\" \",\" \",'Grad 1'!$I$8)","v":" "},{"$f":"IF('Grad 1'!$I$9=\" \",\" \",'Grad 1'!$I$9)","v":" "},{"$f":"IF('Grad 1'!$I$10=\" \",\" \",'Grad 1'!$I$10)","v":" "},{"$f":"IF('Grad 1'!$I$11=\" \",\" \",'Grad 1'!$I$11)","v":" "},{"$f":"IF('Grad 1'!$I$14=\" \",\" \",'Grad 1'!$I$14)","v":" "},{"$f":"IF(AND('Grad 1'!B4>0,OR('Grad 1'!$B$18=\"Y\",'Grad 1'!B18=\"N\")),'Grad 1'!$B$18,\"\")","v":""},null,"Heated Water ",null,{"$f":"IF('Proj Info'!$B$75=\"\",\"\",\"X\")","v":""},null,null,null,{"$f":"IF(X3=\" \",\" \", X3)","v":""},{"$f":"IF(OR(X4=\"X\", X5=\"X\", X6=\"X\"), \"X\", \"\")","v":""},"To Date",null,"To Date"]
[null,{"$f":"IF('Grad 2'!B3=\"\",\"\",'Grad 2'!B3)","v":""},null,{"$f":"IF('Grad 2'!$B$2=\" \",\" \",'Grad 2'!$B$2)","v":" "},{"$f":"IF('Grad 2'!$I$5=\" \",\" \",'Grad 2'!$I$5)","v":" "},{"$f":"IF('Grad 2'!$I$6=\" \",\" \",'Grad 2'!$I$6)","v":" "},{"$f":"IF('Grad 2'!$I$7=\" \",\" \",'Grad 2'!$I$7)","v":" "},{"$f":"IF('Grad 2'!$I$8=\" \",\" \",'Grad 2'!$I$8)","v":" "},{"$f":"IF('Grad 2'!$I$9=\" \",\" \",'Grad 2'!$I$9)","v":" "},{"$f":"IF('Grad 2'!$I$10=\" \",\" \",'Grad 2'!$I$10)","v":" "},{"$f":"IF('Grad 2'!$I$11=\" \",\" \",'Grad 2'!$I$11)","v":" "},{"$f":"IF('Grad 2'!$I$14=\" \",\" \",'Grad 2'!$I$14)","v":" "},{"$f":"IF(AND('Grad 2'!B4>0,OR('Grad 2'!$B$18=\"Y\",'Grad 2'!B18=\"N\")),'Grad 2'!$B$18,\"\")","v":""},null,"Heated Materials ",null,{"$f":"IF('Proj Info'!$B$76=\"\",\"\",\"X\")","v":""},null,"Concrete:  ",{"$f":"IF('Proj Info'!$B$1=\"M\",'Report '!$AA$1,'Report '!$Z$1)","v":"yd3"},{"$f":"IF(U21=\"X\",SUM(C13:C17),\"\")","v":""},{"$f":"IF(V21=\"X\",SUM(C13:C17),\"\")","v":""},null,{"$f":"SUM(E13:E17)","v":0}]
[null,{"$f":"IF('Grad 3'!B3=\"\",\"\",'Grad 3'!B3)","v":""},null,{"$f":"IF('Grad 3'!$B$2=\" \",\" \",'Grad 3'!$B$2)","v":" "},{"$f":"IF('Grad 3'!$I$5=\" \",\" \",'Grad 3'!$I$5)","v":" "},{"$f":"IF('Grad 3'!$I$6=\" \",\" \",'Grad 3'!$I$6)","v":" "},{"$f":"IF('Grad 3'!$I$7=\" \",\" \",'Grad 3'!$I$7)","v":" "},{"$f":"IF('Grad 3'!$I$8=\" \",\" \",'Grad 3'!$I$8)","v":" "},{"$f":"IF('Grad 3'!$I$9=\" \",\" \",'Grad 3'!$I$9)","v":" "},{"$f":"IF('Grad 3'!$I$10=\" \",\" \",'Grad 3'!$I$10)","v":" "},{"$f":"IF('Grad 3'!$I$11=\" \",\" \",'Grad 3'!$I$11)","v":" "},{"$f":"IF('Grad 3'!$I$14=\" \",\" \",'Grad 3'!$I$14)","v":" "},{"$f":"IF(AND('Grad 3'!B4>0, OR('Grad 3'!$B$18=\"Y\",'Grad 3'!B18=\"N\")), 'Grad 3'!$B$18,\"\")","v":""},null,"Liquid Nitrogen",null,{"$f":"IF('Proj Info'!$B$77=\"\",\"\",\"X\")","v":""},null,"Cement:  ",{"$f":"IF('Proj Info'!$B$1=\"M\",'Report '!$AA$5,'Report '!$Z$5)","v":"tons"},{"$f":"IF(U21=\"X\",(((C13*O13)+(C14*O14)+(C15*O15)+(C16*O16)+(C17*O17))/Z18),\" \")","v":" "},{"$f":"IF(V21=\"X\",(((C13*O13)+(C14*O14)+(C15*O15)+(C16*O16)+(C17*O17))/Z18),\" \")","v":" "}]
[null,null,null,null,null,null,null,null,null,null,null,null,null,null,null,"Dose (oz/cy)","Cement Redux.","%",null,null,null,null,null,null,null,null,null,null,null,null,null,null,null,{"$f":"AND('Grad 3'!$B$22>0, X41=6, OR(AND('Proj Info'!$E$43=1.5, L29>1.5), AND('Proj Info'!$E$43=2.5, L29>2.5)), OR(E820150A!$B$2=\"QMC\", E820150A!$B$2=\"QMCDM\", E820150A!$C$2=\"QMC\", E820150A!$C$2=\"QMCDM\", E820150A!$D$2=\"QMC\", E820150A!$D$2=\"QMCDM\", E820150A!$E$2=\"QMC\", E820150A!$E$2=\"QMCDM\", E820150A!$F$2=\"QMC\", E820150A!$F$2=\"QMCDM\"))","v":false}]
[null,null,"Intermediate",null,{"$f":"IF('Proj Info'!$B$1=\"M\",'Report '!$AA$6,'Report '!$Z$6)","v":"1  1/2\""},{"$f":"IF('Proj Info'!$B$1=\"M\",'Report '!$AA$7,'Report '!$Z$7)","v":"1\""},{"$f":"IF('Proj Info'!$B$1=\"M\",'Report '!$AA$8,'Report '!$Z$8)","v":"3/4\""},{"$f":"IF('Proj Info'!$B$1=\"M\",'Report '!$AA$9,'Report '!$Z$9)","v":"1/2\""},{"$f":"IF('Proj Info'!$B$1=\"M\",'Report '!$AB$10,'Report '!$AA$10)","v":"3/8\""},{"$f":"IF('Proj Info'!$B$1=\"M\",'Report '!$AB$11,'Report '!$AA$11)","v":"#4"},{"$f":"IF('Proj Info'!$B$1=\"M\",'Report '!$AB$12,'Report '!$AA$12)","v":"#8"},{"$f":"IF('Proj Info'!$B$1=\"M\",'Report '!$AB$17,'Report '!$AA$17)","v":"#200"},"Comply",null,{"$f":"IF(AND('Proj Info'!B71=\"\",'Proj Info'!C71=\"\"),\"CO2 Admix:\",IF('Proj Info'!B71<>\"\",_xlfn.CONCAT('Proj Info'!B71,\":\"),_xlfn.CONCAT('Proj Info'!C71,\":\")))","v":"CO2 Admix:"},{"$f":"IF('Proj Info'!B72=\"\",\"\",'Proj Info'!B72)","v":""},{"$f":"IF('Mix Info'!B27=\"\",\"\",'E820150'!C15)","v":""},{"$f":"IF('Mix Info'!B27=\"\",\"\",'Mix Info'!B27)","v":""},"Brand / Source",null,null,"Rate","     Lot Number"]
[null,"Sample Date:",{"$f":"IF(AND('Mix Info'!H4<>\"\",'Mix Info'!H6<>\"\"),'Mix Info'!H6,\"\")","v":""},null,null,null,{"$f":"IF('Proj Info'!B98=\"\",\"\",'Proj Info'!B98)","v":""},{"$f":"IF('Proj Info'!B99=\"\",\"\",'Proj Info'!B99)","v":""},{"$f":"IF('Proj Info'!B100=\"\",\"\",'Proj Info'!B100)","v":""},{"$f":"IF('Proj Info'!B101=\"\",\"\",'Proj Info'!B101)","v":""},{"$f":"IF('Proj Info'!B102=\"\",\"\",'Proj Info'!B102)","v":""},{"$f":"IF('Proj Info'!B103=\"\",\"\",'Proj Info'!B103)","v":""},"Y/N",null,null,null,null,"Air Entraining:  ",{"$f":"IF(AND('Proj Info'!B48=\"\",'Proj Info'!C48=\"\"),\"\",IF('Proj Info'!B48<>\"\", 'Proj Info'!B48, 'Proj Info'!C48))","v":""},null,null,{"$f":"IF(AND('Proj Info'!B49=\"\",'Proj Info'!C49=\"\"),\"\",IF('Proj Info'!B49<>\"\", 'Proj Info'!B49, 'Proj Info'!C49))","v":""},{"$f":"IF(AND('Proj Info'!B50=\"\",'Proj Info'!C50=\"\"),\"\",IF('Proj Info'!B50<>\"\", 'Proj Info'!B50, 'Proj Info'!C50))","v":""}]
[null,{"$f":"IF('Grad 1'!B21=\"\",\"\",'Grad 1'!B21)","v":""},null,{"$f":"IF('Grad 1'!$B$20=\" \",\" \",'Grad 1'!$B$20)","v":" "},{"$f":"IF('Grad 1'!$I$23=\" \",\" \",'Grad 1'!$I$23)","v":" "},{"$f":"IF('Grad 1'!$I$24=\" \",\" \",'Grad 1'!$I$24)","v":" "},{"$f":"IF('Grad 1'!$I$25=\" \",\" \",'Grad 1'!$I$25)","v":" "},{"$f":"IF('Grad 1'!$I$26=\" \",\" \",'Grad 1'!$I$26)","v":" "},{"$f":"IF('Grad 1'!$I$27=\" \",\" \",'Grad 1'!$I$27)","v":" "},{"$f":"IF('Grad 1'!$I$28=\" \",\" \",'Grad 1'!$I$28)","v":" "},{"$f":"IF('Grad 1'!$I$29=\" \",\" \",'Grad 1'!$I$29)","v":" "},{"$f":"IF('Grad 1'!$I$32=\" \",\" \",'Grad 1'!$I$32)","v":" "},{"$f":"IF(AND('Grad 1'!B22>0, OR('Grad 1'!$B$36=\"Y\", 'Grad 1'!B36=\"N\")),'Grad 1'!$B$36,\"\")","v":""},null,null,null,null,"Normal Water Reducer:  ",{"$f":"IF(AND('Proj Info'!B51=\"\",'Proj Info'!C51=\"\"),\"\",IF('Proj Info'!B51<>\"\", 'Proj Info'!B51, 'Proj Info'!C51))","v":""},null,null,{"$f":"IF(AND('Proj Info'!B52=\"\",'Proj Info'!C52=\"\"),\"\",IF('Proj Info'!B52<>\"\", 'Proj Info'!B52, 'Proj Info'!C52))","v":""},{"$f":"IF(AND('Proj Info'!B53=\"\",'Proj Info'!C53=\"\"),\"\",IF('Proj Info'!B53<>\"\", 'Proj Info'!B53, 'Proj Info'!C53))","v":""}]
[null,{"$f":"IF('Grad 2'!B21=\"\",\"\",'Grad 2'!B21)","v":""},null,{"$f":"IF('Grad 2'!$B$20=\" \",\" \",'Grad 2'!$B$20)","v":" "},{"$f":"IF('Grad 2'!$I$23=\" \",\" \",'Grad 2'!$I$23)","v":" "},{"$f":"IF('Grad 2'!$I$24=\" \",\" \",'Grad 2'!$I$24)","v":" "},{"$f":"IF('Grad 2'!$I$25=\" \",\" \",'Grad 2'!$I$25)","v":" "},{"$f":"IF('Grad 2'!$I$26=\" \",\" \",'Grad 2'!$I$26)","v":" "},{"$f":"IF('Grad 2'!$I$27=\" \",\" \",'Grad 2'!$I$27)","v":" "},{"$f":"IF('Grad 2'!$I$28=\" \",\" \",'Grad 2'!$I$28)","v":" "},{"$f":"IF('Grad 2'!$I$29=\" \",\" \",'Grad 2'!$I$29)","v":" "},{"$f":"IF('Grad 2'!$I$32=\" \",\" \",'Grad 2'!$I$32)","v":" "},{"$f":"IF(AND('Grad 2'!B22>0, OR('Grad 2'!$B$36=\"Y\", 'Grad 2'!B36=\"N\")),'Grad 2'!$B$36,\"\")","v":""},null,null,null,null,"             Mid-Range Water Reducer:  ",{"$f":"IF(AND('Proj Info'!B54=\"\",'Proj Info'!C54=\"\"),\"\",IF('Proj Info'!B54<>\"\", 'Proj Info'!B54, 'Proj Info'!C54))","v":""},null,null,{"$f":"IF(AND('Proj Info'!B55=\"\",'Proj Info'!C55=\"\"),\"\",IF('Proj Info'!B55<>\"\", 'Proj Info'!B55, 'Proj Info'!C55))","v":""},{"$f":"IF(AND('Proj Info'!B56=\"\",'Proj Info'!C56=\"\"),\"\",IF('Proj Info'!B56<>\"\", 'Proj Info'!B56, 'Proj Info'!C56))","v":""}]
[null,{"$f":"IF('Grad 3'!B21=\"\",\"\",'Grad 3'!B21)","v":""},null,{"$f":"IF('Grad 3'!$B$20=\" \",\" \",'Grad 3'!$B$20)","v":" "},{"$f":"IF('Grad 3'!$I$23=\" \",\" \",'Grad 3'!$I$23)","v":" "},{"$f":"IF('Grad 3'!$I$24=\" \",\" \",'Grad 3'!$I$24)","v":" "},{"$f":"IF('Grad 3'!$I$25=\" \",\" \",'Grad 3'!$I$25)","v":" "},{"$f":"IF('Grad 3'!$I$26=\" \",\" \",'Grad 3'!$I$26)","v":" "},{"$f":"IF('Grad 3'!$I$27=\" \",\" \",'Grad 3'!$I$27)","v":" "},{"$f":"IF('Grad 3'!$I$28=\" \",\" \",'Grad 3'!$I$28)","v":" "},{"$f":"IF('Grad 3'!$I$29=\" \",\" \",'Grad 3'!$I$29)","v":" "},{"$f":"IF('Grad 3'!$I$32=\" \",\" \",'Grad 3'!$I$32)","v":" "},{"$f":"IF(AND('Grad 3'!B22>0, OR('Grad 3'!B36=\"Y\",'Grad 3'!B36=\"N\")),'Grad 3'!B36,\"\")","v":""},null,null,null,null,"High-Range Water Reducer:  ",{"$f":"IF(AND('Proj Info'!B57=\"\",'Proj Info'!C57=\"\"),\"\",IF('Proj Info'!B57<>\"\", 'Proj Info'!B57, 'Proj Info'!C57))","v":""},null,null,{"$f":"IF(AND('Proj Info'!B58=\"\",'Proj Info'!C58=\"\"),\"\",IF('Proj Info'!B58<>\"\", 'Proj Info'!B58, 'Proj Info'!C58))","v":""},{"$f":"IF(AND('Proj Info'!B59=\"\",'Proj Info'!C59=\"\"),\"\",IF('Proj Info'!B59<>\"\", 'Proj Info'!B59, 'Proj Info'!C59))","v":""}]
[null,null,null,null,null,null,null,null,null,null,null,null,null,null,null,null,null,"Retarder:  ",{"$f":"IF(AND('Proj Info'!B60=\"\",'Proj Info'!C60=\"\"),\"\",IF('Proj Info'!B60<>\"\", 'Proj Info'!B60, 'Proj Info'!C60))","v":""},null,null,{"$f":"IF(AND('Proj Info'!B61=\"\",'Proj Info'!C61=\"\"),\"\",IF('Proj Info'!B61<>\"\", 'Proj Info'!B61, 'Proj Info'!C61))","v":""},{"$f":"IF(AND('Proj Info'!B62=\"\",'Proj Info'!C62=\"\"),\"\",IF('Proj Info'!B62<>\"\", 'Proj Info'!B62, 'Proj Info'!C62))","v":""}]
[null,null,"Fine",{"$f":"IF('Proj Info'!$B$1=\"M\",'Report '!$AA$9,'Report '!$Z$9)","v":"1/2\""},{"$f":"IF('Proj Info'!$B$1=\"M\",'Report '!$AB$10,'Report '!$AA$10)","v":"3/8\""},{"$f":"IF('Proj Info'!$B$1=\"M\",'Report '!$AB$11,'Report '!$AA$11)","v":"#4"},{"$f":"IF('Proj Info'!$B$1=\"M\",'Report '!$AB$12,'Report '!$AA$12)","v":"#8"},{"$f":"IF('Proj Info'!$B$1=\"M\",'Report '!$AB$13,'Report '!$AA$13)","v":"#16"},{"$f":"IF('Proj Info'!$B$1=\"M\",'Report '!$AB$14,'Report '!$AA$14)","v":"#30"},{"$f":"IF('Proj Info'!$B$1=\"M\",'Report '!$AB$15,'Report '!$AA$15)","v":"#50"},{"$f":"IF('Proj Info'!$B$1=\"M\",'Report '!$AB$16,'Report '!$AA$16)","v":"#100"},{"$f":"IF('Proj Info'!$B$1=\"M\",'Report '!$AB$17,'Report '!$AA$17)","v":"#200"},"Comply",null,null,null,null,"    Special Performance Admixturer:  ",{"$f":"IF(AND('Proj Info'!B63=\"\",'Proj Info'!C63=\"\"),\"\",IF('Proj Info'!B63<>\"\", 'Proj Info'!B63, 'Proj Info'!C63))","v":""},null,null,{"$f":"IF(AND('Proj Info'!B64=\"\",'Proj Info'!C64=\"\"),\"\",IF('Proj Info'!B64<>\"\", 'Proj Info'!B64, 'Proj Info'!C64))","v":""},{"$f":"IF(AND('Proj Info'!B65=\"\",'Proj Info'!C65=\"\"),\"\",IF('Proj Info'!B65<>\"\", 'Proj Info'!B65, 'Proj Info'!C65))","v":""}]
[null,"SampleDate:",{"$f":"IF(AND('Mix Info'!H4<>\"\",'Mix Info'!H7<>\"\"),'Mix Info'!H7,\"\")","v":""},null,{"$f":"IF('Proj Info'!$B$104=\" \",\" \",'Proj Info'!$B$104)","v":""},{"$f":"IF('Proj Info'!$B$105=\" \",\" \",'Proj Info'!$B$105)","v":""},{"$f":"IF('Proj Info'!$B$106=\" \",\" \",'Proj Info'!$B$106)","v":""},null,{"$f":"IF('Proj Info'!$B$107=\" \",\" \",'Proj Info'!$B$107)","v":""},null,null,{"$f":"IF('Proj Info'!$B$108=\" \",\" \",'Proj Info'!$B$108)","v":""},"Y/N",null,null,null,null,"Concrete Fibers:  ",{"$f":"IF(AND('Proj Info'!B69=\"\",'Proj Info'!C69=\"\"),\"\",IF('Proj Info'!B69<>\"\", 'Proj Info'!B69, 'Proj Info'!C69))","v":""},null,null,{"$f":"IF('Proj Info'!B70=\"\",\"\",'Proj Info'!B70)","v":""}]
[null,{"$f":"IF('Grad 1'!B40=\"\",\"\",'Grad 1'!B40)","v":""},{"$f":"IF('Grad 1'!$B$39=\" \",\" \",'Grad 1'!$B$39)","v":" "},{"$f":"IF(E33=100,\"\",IF('Grad 1'!$I$43=\" \",\" \",'Grad 1'!$I$43))","v":" "},{"$f":"IF('Grad 1'!$I$44=\" \",\" \",'Grad 1'!$I$44)","v":" "},{"$f":"IF('Grad 1'!$I$45=\" \",\" \",'Grad 1'!$I$45)","v":" "},{"$f":"IF('Grad 1'!$I$46=\" \",\" \",'Grad 1'!$I$46)","v":" "},{"$f":"IF('Grad 1'!$I$47=\" \",\" \",'Grad 1'!$I$47)","v":" "},{"$f":"IF('Grad 1'!$I$48=\" \",\" \",'Grad 1'!$I$48)","v":" "},{"$f":"IF('Grad 1'!$I$49=\" \",\" \",'Grad 1'!$I$49)","v":" "},{"$f":"IF('Grad 1'!$I$50=\" \",\" \",'Grad 1'!$I$50)","v":" "},{"$f":"IF('Grad 1'!$B$51>0,'Grad 1'!$I$51,\"\")","v":""},{"$f":"IF(AND('Grad 1'!B41>0, OR('Grad 1'!$B$54=\"Y\",'Grad 1'!B54=\"N\")),'Grad 1'!$B$54,\"\")","v":""},null,null,null,null,null,{"$f":"IF(AND(S36=\"\", OR('Mix Info'!B7<>\"\",'Mix Info'!C7<>\"\",'Mix Info'!D7<>\"\",'Mix Info'!E7<>\"\",'Mix Info'!F7<>\"\")),  \"Flyash Information Missing\",\"\")","v":""}]
[null,{"$f":"IF('Grad 2'!B40=\"\",\"\",'Grad 2'!B40)","v":""},{"$f":"IF('Grad 2'!$B$39=\" \",\" \",'Grad 2'!$B$39)","v":" "},{"$f":"IF(E34=100,\"\",IF('Grad 2'!$I$43=\" \",\" \",'Grad 2'!$I$43))","v":" "},{"$f":"IF('Grad 2'!$I$44=\" \",\" \",'Grad 2'!$I$44)","v":" "},{"$f":"IF('Grad 2'!$I$45=\" \",\" \",'Grad 2'!$I$45)","v":" "},{"$f":"IF('Grad 2'!$I$46=\" \",\" \",'Grad 2'!$I$46)","v":" "},{"$f":"IF('Grad 2'!$I$47=\" \",\" \",'Grad 2'!$I$47)","v":" "},{"$f":"IF('Grad 2'!$I$48=\" \",\" \",'Grad 2'!$I$48)","v":" "},{"$f":"IF('Grad 2'!$I$49=\" \",\" \",'Grad 2'!$I$49)","v":" "},{"$f":"IF('Grad 2'!$I$50=\" \",\" \",'Grad 2'!$I$50)","v":" "},{"$f":"IF('Grad 2'!$B$51>0,'Grad 2'!$I$51,\"\")","v":""},{"$f":"IF(AND('Grad 2'!B41>0, OR('Grad 2'!$B$54=\"Y\",'Grad 2'!B54=\"N\")),'Grad 2'!$B$54,\"\")","v":""},null,null,null,null,null,"Type","Sp. Gr.","Source"]
[null,{"$f":"IF('Grad 3'!B40=\"\",\"\",'Grad 3'!B40)","v":""},{"$f":"IF('Grad 3'!$B$39=\" \",\" \",'Grad 3'!$B$39)","v":" "},{"$f":"IF(E35=100,\"\",IF('Grad 3'!$I$43=\" \",\" \",'Grad 3'!$I$43))","v":" "},{"$f":"IF('Grad 3'!$I$44=\" \",\" \",'Grad 3'!$I$44)","v":" "},{"$f":"IF('Grad 3'!$I$45=\" \",\" \",'Grad 3'!$I$45)","v":" "},{"$f":"IF('Grad 3'!$I$46=\" \",\" \",'Grad 3'!$I$46)","v":" "},{"$f":"IF('Grad 3'!$I$47=\" \",\" \",'Grad 3'!$I$47)","v":" "},{"$f":"IF('Grad 3'!$I$48=\" \",\" \",'Grad 3'!$I$48)","v":" "},{"$f":"IF('Grad 3'!$I$49=\" \",\" \",'Grad 3'!$I$49)","v":" "},{"$f":"IF('Grad 3'!$I$50=\" \",\" \",'Grad 3'!$I$50)","v":" "},{"$f":"IF('Grad 3'!$B$51>0,'Grad 3'!$I$51,\"\")","v":""},{"$f":"IF(AND('Grad 3'!B41>0, OR('Grad 3'!$B$54=\"Y\",'Grad 3'!B54=\"N\")), 'Grad 3'!$B$54,\"\")","v":""},null,null,null,null,"Cement:  ",{"$f":"IF(AND('Proj Info'!B34=\"\", 'Proj Info'!C34=\"\"), \"\", IF('Proj Info'!B34<>\"\", 'Proj Info'!B34,'Proj Info'!C34))","v":""},{"$f":"IF(AND('Proj Info'!B35=\"\", 'Proj Info'!C35=\"\"), \"\", IF('Proj Info'!B35<>\"\", 'Proj Info'!B35,'Proj Info'!C35))","v":""},{"$f":"IF(AND('Proj Info'!B33=\"\", 'Proj Info'!C33=\"\"), \"\", IF('Proj Info'!B33<>\"\", 'Proj Info'!B33,'Proj Info'!C33))","v":""},null,null,null,{"$f":"IF(U35=\"\",\"\", VLOOKUP(U35,CEMENT!A4:F57,6,FALSE))","v":""}]
[null,null,null,null,null,null,null,null,null,null,null,null,null,null,null,null,null,"Fly Ash:  ",{"$f":"IF(AND('Proj Info'!B37=\"\", 'Proj Info'!C37=\"\"), \"\", IF('Proj Info'!B37<>\"\", 'Proj Info'!B37,'Proj Info'!C37))","v":""},{"$f":"IF(AND('Proj Info'!B38=\"\", 'Proj Info'!C38=\"\"), \"\", IF('Proj Info'!B38<>\"\", 'Proj Info'!B38,'Proj Info'!C38))","v":""},{"$f":"IF(AND('Proj Info'!B36=\"\", 'Proj Info'!C36=\"\"), \"\", IF('Proj Info'!B36<>\"\", 'Proj Info'!B36,'Proj Info'!C36))","v":""}]
[null,null,"Adjusted % Passing Calculated Combined Gradation",null,null,null,null,null,null,null,null,null,null,null,null,null,null,"GGBFS:  ",{"$f":"IF(AND('Proj Info'!B40=\"\", 'Proj Info'!C40=\"\"), \"\", IF('Proj Info'!B40<>\"\", 'Proj Info'!B40,'Proj Info'!C40))","v":""},{"$f":"IF(AND('Proj Info'!B41=\"\", 'Proj Info'!C41=\"\"), \"\", IF('Proj Info'!B41<>\"\", 'Proj Info'!B41,'Proj Info'!C41))","v":""},{"$f":"IF(AND('Proj Info'!B39=\"\", 'Proj Info'!C39=\"\"), \"\", IF('Proj Info'!B39<>\"\", 'Proj Info'!B39,'Proj Info'!C39))","v":""}]
[null,null,{"$f":"IF('Proj Info'!$B$1=\"M\",'Report '!$AA$6,'Report '!$Z$6)","v":"1  1/2\""},{"$f":"IF('Proj Info'!$B$1=\"M\",'Report '!$AA$7,'Report '!$Z$7)","v":"1\""},{"$f":"IF('Proj Info'!$B$1=\"M\",'Report '!$AA$8,'Report '!$Z$8)","v":"3/4\""},{"$f":"IF('Proj Info'!$B$1=\"M\",'Report '!$AA$9,'Report '!$Z$9)","v":"1/2\""},{"$f":"IF('Proj Info'!$B$1=\"M\",'Report '!$AB$10,'Report '!$AA$10)","v":"3/8\""},{"$f":"IF('Proj Info'!$B$1=\"M\",'Report '!$AB$11,'Report '!$AA$11)","v":"#4"},{"$f":"IF('Proj Info'!$B$1=\"M\",'Report '!$AB$12,'Report '!$AA$12)","v":"#8"},{"$f":"IF('Proj Info'!$B$1=\"M\",'Report '!$AB$13,'Report '!$AA$13)","v":"#16"},{"$f":"IF('Proj Info'!$B$1=\"M\",'Report '!$AB$14,'Report '!$AA$14)","v":"#30"},{"$f":"IF('Proj Info'!$B$1=\"M\",'Report '!$AB$15,'Report '!$AA$15)","v":"#50"},{"$f":"IF('Proj Info'!$B$1=\"M\",'Report '!$AB$16,'Report '!$AA$16)","v":"#100"},{"$f":"IF('Proj Info'!$B$1=\"M\",'Report '!$AB$17,'Report '!$AA$17)","v":"#200"},"Within","CW"]
[null,"Target",{"$f":"IF(OR('Mix Info'!$B$2=\"QMC\", 'Mix Info'!$B$2=\"C-SUD\", 'Mix Info'!$B$2=\"QMPEM\",'Mix Info'!$C$2=\"QMC\", 'Mix Info'!$C$2=\"C-SUD\", 'Mix Info'!$C$2=\"QMPEM\",'Mix Info'!$D$2=\"QMC\", 'Mix Info'!$D$2=\"C-SUD\", 'Mix Info'!$D$2=\"QMPEM\",'Mix Info'!$E$2=\"QMC\", 'Mix Info'!$E$2=\"C-SUD\", 'Mix Info'!$E$2=\"QMPEM\",'Mix Info'!$F$2=\"QMC\", 'Mix Info'!$F$2=\"C-SUD\", 'Mix Info'!$F$2=\"QMPEM\"),Combined!$L18,\" \")","v":" "},{"$f":"IF(OR('Mix Info'!$B$2=\"QMC\", 'Mix Info'!$B$2=\"C-SUD\", 'Mix Info'!$B$2=\"QMPEM\",'Mix Info'!$C$2=\"QMC\", 'Mix Info'!$C$2=\"C-SUD\", 'Mix Info'!$C$2=\"QMPEM\",'Mix Info'!$D$2=\"QMC\", 'Mix Info'!$D$2=\"C-SUD\", 'Mix Info'!$D$2=\"QMPEM\",'Mix Info'!$E$2=\"QMC\", 'Mix Info'!$E$2=\"C-SUD\", 'Mix Info'!$E$2=\"QMPEM\",'Mix Info'!$F$2=\"QMC\", 'Mix Info'!$F$2=\"C-SUD\", 'Mix Info'!$F$2=\"QMPEM\"),Combined!$L19,\" \")","v":" "},{"$f":"IF(OR('Mix Info'!$B$2=\"QMC\", 'Mix Info'!$B$2=\"C-SUD\", 'Mix Info'!$B$2=\"QMPEM\",'Mix Info'!$C$2=\"QMC\", 'Mix Info'!$C$2=\"C-SUD\", 'Mix Info'!$C$2=\"QMPEM\",'Mix Info'!$D$2=\"QMC\", 'Mix Info'!$D$2=\"C-SUD\", 'Mix Info'!$D$2=\"QMPEM\",'Mix Info'!$E$2=\"QMC\", 'Mix Info'!$E$2=\"C-SUD\", 'Mix Info'!$E$2=\"QMPEM\",'Mix Info'!$F$2=\"QMC\", 'Mix Info'!$F$2=\"C-SUD\", 'Mix Info'!$F$2=\"QMPEM\"),Combined!$L20,\" \")","v":" "},{"$f":"IF(OR('Mix Info'!$B$2=\"QMC\", 'Mix Info'!$B$2=\"C-SUD\", 'Mix Info'!$B$2=\"QMPEM\",'Mix Info'!$C$2=\"QMC\", 'Mix Info'!$C$2=\"C-SUD\", 'Mix Info'!$C$2=\"QMPEM\",'Mix Info'!$D$2=\"QMC\", 'Mix Info'!$D$2=\"C-SUD\", 'Mix Info'!$D$2=\"QMPEM\",'Mix Info'!$E$2=\"QMC\", 'Mix Info'!$E$2=\"C-SUD\", 'Mix Info'!$E$2=\"QMPEM\",'Mix Info'!$F$2=\"QMC\", 'Mix Info'!$F$2=\"C-SUD\", 'Mix Info'!$F$2=\"QMPEM\"),Combined!$L21,\" \")","v":" "},{"$f":"IF(OR('Mix Info'!$B$2=\"QMC\", 'Mix Info'!$B$2=\"C-SUD\", 'Mix Info'!$B$2=\"QMPEM\",'Mix Info'!$C$2=\"QMC\", 'Mix Info'!$C$2=\"C-SUD\", 'Mix Info'!$C$2=\"QMPEM\",'Mix Info'!$D$2=\"QMC\", 'Mix Info'!$D$2=\"C-SUD\", 'Mix Info'!$D$2=\"QMPEM\",'Mix Info'!$E$2=\"QMC\", 'Mix Info'!$E$2=\"C-SUD\", 'Mix Info'!$E$2=\"QMPEM\",'Mix Info'!$F$2=\"QMC\", 'Mix Info'!$F$2=\"C-SUD\", 'Mix Info'!$F$2=\"QMPEM\"),Combined!$L22,\" \")","v":" "},{"$f":"IF(OR('Mix Info'!$B$2=\"QMC\", 'Mix Info'!$B$2=\"C-SUD\", 'Mix Info'!$B$2=\"QMPEM\",'Mix Info'!$C$2=\"QMC\", 'Mix Info'!$C$2=\"C-SUD\", 'Mix Info'!$C$2=\"QMPEM\",'Mix Info'!$D$2=\"QMC\", 'Mix Info'!$D$2=\"C-SUD\", 'Mix Info'!$D$2=\"QMPEM\",'Mix Info'!$E$2=\"QMC\", 'Mix Info'!$E$2=\"C-SUD\", 'Mix Info'!$E$2=\"QMPEM\",'Mix Info'!$F$2=\"QMC\", 'Mix Info'!$F$2=\"C-SUD\", 'Mix Info'!$F$2=\"QMPEM\"),Combined!$L23,\" \")","v":" "},{"$f":"IF(OR('Mix Info'!$B$2=\"QMC\", 'Mix Info'!$B$2=\"C-SUD\", 'Mix Info'!$B$2=\"QMPEM\",'Mix Info'!$C$2=\"QMC\", 'Mix Info'!$C$2=\"C-SUD\", 'Mix Info'!$C$2=\"QMPEM\",'Mix Info'!$D$2=\"QMC\", 'Mix Info'!$D$2=\"C-SUD\", 'Mix Info'!$D$2=\"QMPEM\",'Mix Info'!$E$2=\"QMC\", 'Mix Info'!$E$2=\"C-SUD\", 'Mix Info'!$E$2=\"QMPEM\",'Mix Info'!$F$2=\"QMC\", 'Mix Info'!$F$2=\"C-SUD\", 'Mix Info'!$F$2=\"QMPEM\"),Combined!$L24,\" \")","v":" "},{"$f":"IF(OR('Mix Info'!$B$2=\"QMC\", 'Mix Info'!$B$2=\"C-SUD\", 'Mix Info'!$B$2=\"QMPEM\",'Mix Info'!$C$2=\"QMC\", 'Mix Info'!$C$2=\"C-SUD\", 'Mix Info'!$C$2=\"QMPEM\",'Mix Info'!$D$2=\"QMC\", 'Mix Info'!$D$2=\"C-SUD\", 'Mix Info'!$D$2=\"QMPEM\",'Mix Info'!$E$2=\"QMC\", 'Mix Info'!$E$2=\"C-SUD\", 'Mix Info'!$E$2=\"QMPEM\",'Mix Info'!$F$2=\"QMC\", 'Mix Info'!$F$2=\"C-SUD\", 'Mix Info'!$F$2=\"QMPEM\"),Combined!$L25,\" \")","v":" "},{"$f":"IF(OR('Mix Info'!$B$2=\"QMC\", 'Mix Info'!$B$2=\"C-SUD\", 'Mix Info'!$B$2=\"QMPEM\",'Mix Info'!$C$2=\"QMC\", 'Mix Info'!$C$2=\"C-SUD\", 'Mix Info'!$C$2=\"QMPEM\",'Mix Info'!$D$2=\"QMC\", 'Mix Info'!$D$2=\"C-SUD\", 'Mix Info'!$D$2=\"QMPEM\",'Mix Info'!$E$2=\"QMC\", 'Mix Info'!$E$2=\"C-SUD\", 'Mix Info'!$E$2=\"QMPEM\",'Mix Info'!$F$2=\"QMC\", 'Mix Info'!$F$2=\"C-SUD\", 'Mix Info'!$F$2=\"QMPEM\"),Combined!$L26,\" \")","v":" "},{"$f":"IF(OR('Mix Info'!$B$2=\"QMC\", 'Mix Info'!$B$2=\"C-SUD\", 'Mix Info'!$B$2=\"QMPEM\",'Mix Info'!$C$2=\"QMC\", 'Mix Info'!$C$2=\"C-SUD\", 'Mix Info'!$C$2=\"QMPEM\",'Mix Info'!$D$2=\"QMC\", 'Mix Info'!$D$2=\"C-SUD\", 'Mix Info'!$D$2=\"QMPEM\",'Mix Info'!$E$2=\"QMC\", 'Mix Info'!$E$2=\"C-SUD\", 'Mix Info'!$E$2=\"QMPEM\",'Mix Info'!$F$2=\"QMC\", 'Mix Info'!$F$2=\"C-SUD\", 'Mix Info'!$F$2=\"QMPEM\"),Combined!$L27,\" \")","v":" "},{"$f":"IF(OR('Mix Info'!$B$2=\"QMC\", 'Mix Info'!$B$2=\"C-SUD\", 'Mix Info'!$B$2=\"QMPEM\",'Mix Info'!$C$2=\"QMC\", 'Mix Info'!$C$2=\"C-SUD\", 'Mix Info'!$C$2=\"QMPEM\",'Mix Info'!$D$2=\"QMC\", 'Mix Info'!$D$2=\"C-SUD\", 'Mix Info'!$D$2=\"QMPEM\",'Mix Info'!$E$2=\"QMC\", 'Mix Info'!$E$2=\"C-SUD\", 'Mix Info'!$E$2=\"QMPEM\",'Mix Info'!$F$2=\"QMC\", 'Mix Info'!$F$2=\"C-SUD\", 'Mix Info'!$F$2=\"QMPEM\"),Combined!$L28,\" \")","v":" "},{"$f":"IF(OR('Mix Info'!$B$2=\"QMC\", 'Mix Info'!$B$2=\"C-SUD\", 'Mix Info'!$B$2=\"QMPEM\",'Mix Info'!$C$2=\"QMC\", 'Mix Info'!$C$2=\"C-SUD\", 'Mix Info'!$C$2=\"QMPEM\",'Mix Info'!$D$2=\"QMC\", 'Mix Info'!$D$2=\"C-SUD\", 'Mix Info'!$D$2=\"QMPEM\",'Mix Info'!$E$2=\"QMC\", 'Mix Info'!$E$2=\"C-SUD\", 'Mix Info'!$E$2=\"QMPEM\",'Mix Info'!$F$2=\"QMC\", 'Mix Info'!$F$2=\"C-SUD\", 'Mix Info'!$F$2=\"QMPEM\"),Combined!$L29,\" \")","v":" "},"Target","Zone",null,null,"T-203 A # & Source",null,null,null,null,"Grad. No."]
[null,null,{"$f":"IF('Mix Info'!$H$4<>\"ENTER\",\"\",Combined!$F18)","v":""},{"$f":"IF('Mix Info'!$H$4<>\"ENTER\",\"\",Combined!$F19)","v":""},{"$f":"IF('Mix Info'!$H$4<>\"ENTER\",\"\",Combined!$F20)","v":""},{"$f":"IF('Mix Info'!$H$4<>\"ENTER\",\"\",Combined!$F21)","v":""},{"$f":"IF('Mix Info'!$H$4<>\"ENTER\",\"\",Combined!$F22)","v":""},{"$f":"IF('Mix Info'!$H$4<>\"ENTER\",\"\",Combined!$F23)","v":""},{"$f":"IF('Mix Info'!$H$4<>\"ENTER\",\"\",Combined!$F24)","v":""},{"$f":"IF('Mix Info'!$H$4<>\"ENTER\",\"\",Combined!$F25)","v":""},{"$f":"IF('Mix Info'!$H$4<>\"ENTER\",\"\",Combined!$F26)","v":""},{"$f":"IF('Mix Info'!$H$4<>\"ENTER\",\"\",Combined!$F27)","v":""},{"$f":"IF('Mix Info'!$H$4<>\"ENTER\",\"\",Combined!$F28)","v":""},{"$f":"IF('Mix Info'!$H$4<>\"ENTER\",\"\",Combined!$F29)","v":""},{"$f":"IF(Combined!F18=0,\"\",IF(AND('Mix Info'!K4=\"ENTER\",OR('Mix Info'!$B$2=\"QMC\", 'Mix Info'!$B$2=\"C-SUD\", 'Mix Info'!$B$2=\"QMPEM\", 'Mix Info'!$B$2=\"C-SUDCW\",'Mix Info'!$C$2=\"QMC\", 'Mix Info'!$C$2=\"C-SUD\", 'Mix Info'!$C$2=\"QMPEM\", 'Mix Info'!$C$2=\"C-SUDCW\",'Mix Info'!$D$2=\"QMC\", 'Mix Info'!$D$2=\"C-SUD\", 'Mix Info'!$D$2=\"QMPEM\", 'Mix Info'!$D$2=\"C-SUDCW\",'Mix Info'!$E$2=\"QMC\", 'Mix Info'!$E$2=\"C-SUD\", 'Mix Info'!$E$2=\"QMPEM\", 'Mix Info'!$E$2=\"C-SUDCW\",'Mix Info'!$F$2=\"QMC\", 'Mix Info'!$F$2=\"C-SUD\", 'Mix Info'!$F$2=\"QMPEM\", 'Mix Info'!$F$2=\"C-SUDCW\")),Combined!L$30,\"\"))","v":""},{"$f":"IF(Combined!F18=0,\"\",IF('Mix Info'!H4=\"ENTER\",Combined!H$32,\" \"))","v":""},null,"Coarse:  ",{"$f":"IF(AND('Proj Info'!B42=\"\",'Proj Info'!C42=\"\"),\"\",IF('Proj Info'!B42<>\"\",'Proj Info'!B42,'Proj Info'!C42))","v":""},null,null,null,null,{"$f":"IF('Proj Info'!B43=\"\",\"\",'Proj Info'!B43)","v":""},{"$f":"IF(S40=\"\",\"\", VLOOKUP(S40,CA!A4:D335,4,FALSE))","v":""}]
[null,null,{"$f":"IF('Mix Info'!$H$4<>\"ENTER\",\"\",Combined!$F40)","v":""},{"$f":"IF('Mix Info'!$H$4<>\"ENTER\",\"\",Combined!$F41)","v":""},{"$f":"IF('Mix Info'!$H$4<>\"ENTER\",\"\",Combined!$F42)","v":""},{"$f":"IF('Mix Info'!$H$4<>\"ENTER\",\"\",Combined!$F43)","v":""},{"$f":"IF('Mix Info'!$H$4<>\"ENTER\",\"\",Combined!$F44)","v":""},{"$f":"IF('Mix Info'!$H$4<>\"ENTER\",\"\",Combined!$F45)","v":""},{"$f":"IF('Mix Info'!$H$4<>\"ENTER\",\"\",Combined!$F46)","v":""},{"$f":"IF('Mix Info'!$H$4<>\"ENTER\",\"\",Combined!$F47)","v":""},{"$f":"IF('Mix Info'!$H$4<>\"ENTER\",\"\",Combined!$F48)","v":""},{"$f":"IF('Mix Info'!$H$4<>\"ENTER\",\"\",Combined!$F49)","v":""},{"$f":"IF('Mix Info'!$H$4<>\"ENTER\",\"\",Combined!$F50)","v":""},{"$f":"IF('Mix Info'!$H$4<>\"ENTER\",\"\",Combined!$F51)","v":""},{"$f":"IF(Combined!F40=0,\"\",IF(AND('Mix Info'!K4=\"ENTER\",OR('Mix Info'!$B$2=\"QMC\", 'Mix Info'!$B$2=\"C-SUD\", 'Mix Info'!$B$2=\"QMPEM\", 'Mix Info'!$B$2=\"C-SUDCW\",'Mix Info'!$C$2=\"QMC\", 'Mix Info'!$C$2=\"C-SUD\", 'Mix Info'!$C$2=\"QMPEM\", 'Mix Info'!$C$2=\"C-SUDCW\",'Mix Info'!$D$2=\"QMC\", 'Mix Info'!$D$2=\"C-SUD\", 'Mix Info'!$D$2=\"QMPEM\", 'Mix Info'!$D$2=\"C-SUDCW\",'Mix Info'!$E$2=\"QMC\", 'Mix Info'!$E$2=\"C-SUD\", 'Mix Info'!$E$2=\"QMPEM\", 'Mix Info'!$E$2=\"C-SUDCW\",'Mix Info'!$F$2=\"QMC\", 'Mix Info'!$F$2=\"C-SUD\", 'Mix Info'!$F$2=\"QMPEM\", 'Mix Info'!$F$2=\"C-SUDCW\")),Combined!L$52,\"\"))","v":""},{"$f":"IF(Combined!F40=0,\"\",IF('Mix Info'!H4=\"ENTER\",Combined!H$54,\" \"))","v":""},null,"Intermediate:  ",{"$f":"IF(AND('Proj Info'!B44=\"\",'Proj Info'!C44=\"\"),\"\",IF('Proj Info'!B44<>\"\",'Proj Info'!B44,'Proj Info'!C44))","v":""},null,null,null,null,{"$f":"IF('Proj Info'!B45=\"\",\"\",'Proj Info'!B45)","v":""},{"$f":"IF(S41=\"\",\"\", VLOOKUP(S41,CA!A4:D335,4,FALSE))","v":""}]
[null,null,{"$f":"IF('Mix Info'!$H$4<>\"ENTER\",\"\",Combined!$F63)","v":""},{"$f":"IF('Mix Info'!$H$4<>\"ENTER\",\"\",Combined!$F64)","v":""},{"$f":"IF('Mix Info'!$H$4<>\"ENTER\",\"\",Combined!$F65)","v":""},{"$f":"IF('Mix Info'!$H$4<>\"ENTER\",\"\",Combined!$F66)","v":""},{"$f":"IF('Mix Info'!$H$4<>\"ENTER\",\"\",Combined!$F67)","v":""},{"$f":"IF('Mix Info'!$H$4<>\"ENTER\",\"\",Combined!$F68)","v":""},{"$f":"IF('Mix Info'!$H$4<>\"ENTER\",\"\",Combined!$F69)","v":""},{"$f":"IF('Mix Info'!$H$4<>\"ENTER\",\"\",Combined!$F70)","v":""},{"$f":"IF('Mix Info'!$H$4<>\"ENTER\",\"\",Combined!$F71)","v":""},{"$f":"IF('Mix Info'!$H$4<>\"ENTER\",\"\",Combined!$F72)","v":""},{"$f":"IF('Mix Info'!$H$4<>\"ENTER\",\"\",Combined!$F73)","v":""},{"$f":"IF('Mix Info'!$H$4<>\"ENTER\",\"\",Combined!$F74)","v":""},{"$f":"IF(Combined!F63=0,\"\",IF(AND('Mix Info'!K4=\"ENTER\",OR('Mix Info'!$B$2=\"QMC\", 'Mix Info'!$B$2=\"C-SUD\", 'Mix Info'!$B$2=\"QMPEM\", 'Mix Info'!$B$2=\"C-SUDCW\",'Mix Info'!$C$2=\"QMC\", 'Mix Info'!$C$2=\"C-SUD\", 'Mix Info'!$C$2=\"QMPEM\", 'Mix Info'!$C$2=\"C-SUDCW\",'Mix Info'!$D$2=\"QMC\", 'Mix Info'!$D$2=\"C-SUD\", 'Mix Info'!$D$2=\"QMPEM\", 'Mix Info'!$D$2=\"C-SUDCW\",'Mix Info'!$E$2=\"QMC\", 'Mix Info'!$E$2=\"C-SUD\", 'Mix Info'!$E$2=\"QMPEM\", 'Mix Info'!$E$2=\"C-SUDCW\",'Mix Info'!$F$2=\"QMC\", 'Mix Info'!$F$2=\"C-SUD\", 'Mix Info'!$F$2=\"QMPEM\", 'Mix Info'!$F$2=\"C-SUDCW\")),Combined!L$75,\"\"))","v":""},{"$f":"IF(Combined!F63=0,\"\",IF('Mix Info'!H4=\"ENTER\",Combined!H$77,\" \"))","v":""},null,"Fine:  ",{"$f":"IF(AND('Proj Info'!B46=\"\",'Proj Info'!C46=\"\"),\"\",IF('Proj Info'!B46<>\"\",'Proj Info'!B46,'Proj Info'!C46))","v":""},null,null,null,null,{"$f":"IF('Proj Info'!B47=\"\",\"\",'Proj Info'!B47)","v":""}]
[]
[null,"Certified RM",{"$f":"IF('Proj Info'!B109=\"Y\",'Proj Info'!D111,\" \")","v":"The PCC mix contains certified materials, approved aggregates, and was produced in compliance with applicable specifications"}]
[null,"Remarks",null,null,null,null,null,null,null,null,null,null,null,null,null,"C.P.I. #1: ",{"$f":"IF('Proj Info'!B78=\"\",\"\",('Proj Info'!B78))","v":""},null,null,null,null,{"$f":"IF('Proj Info'!B79=\"\",\"\",('Proj Info'!B79))","v":""}]
[null,null,null,null,null,null,null,null,null,null,null,null,null,null,null,"C.P.I. #2: ",{"$f":"IF('Proj Info'!B81=\"\",\"\",('Proj Info'!B81))","v":""},null,null,null,null,{"$f":"IF('Proj Info'!B82=\"\",\"\",('Proj Info'!B82))","v":""}]
[null,null,null,null,null,null,null,null,null,null,null,null,null,null,null,"Monitor #1: ",{"$f":"IF('Proj Info'!B84=\"\",\"\",('Proj Info'!B84))","v":""},null,null,null,null,{"$f":"IF('Proj Info'!B85=\"\",\"\",('Proj Info'!B85))","v":""}]
[null,null,"Distribution:     _____   DME     _____   Proj. Eng.     _____   Plant",null,null,null,null,null,null,null,null,null,null,null,null,"Monitor #2: ",{"$f":"IF('Proj Info'!B87=\"\",\"\",('Proj Info'!B87))","v":""},null,null,null,null,{"$f":"IF('Proj Info'!B88=\"\",\"\",('Proj Info'!B88))","v":""}]

{"sheet":"Summary","index":14,"n_rows":12,"n_cols":9,"rows_kept":12,"cut":false,"hidden":false,"merged":[]}
["Material Production Summary",null,null,null,null,"Proj. No.:",{"$f":"IF('Report '!H3=\"\",\"\",'Report '!H3)","v":""},null,{"$f":"IF('Proj Info'!$B$1=\"M\",1000,2000)","v":2000}]
[null,null,null,null,null,"Report #:",{"$f":"IF('Report '!R3=\"\",\"\",'Report '!R3)","v":""}]
[null,null,null,null,"Fine","Intermediate","Coarse"]
[null,"Cement","Fly Ash","GGBFS","Aggregate","Aggregate","Aggregate","Mix"]
["Date",{"$f":"'Report '!$T$23","v":"tons"},{"$f":"'Report '!$T$23","v":"tons"},{"$f":"'Report '!$T$23","v":"tons"},{"$f":"'Report '!$T$23","v":"tons"},{"$f":"'Report '!$T$23","v":"tons"},{"$f":"'Report '!$T$23","v":"tons"},"Identification"]
[{"$f":"IF(B6=0,\"\",'Mix Info'!B3)","v":""},{"$f":"ROUND(IF('Report '!$C13=\"\",\"\",SUM(('Report '!$C13*'Report '!O13))/$I1),3)","v":0},{"$f":"ROUND(IF('Report '!$C13=\"\",\"\",SUM(('Report '!$C13*'Report '!P13))/$I1),3)","v":0},{"$f":"ROUND(IF('Report '!$C13=\"\",\"\",SUM(('Report '!$C13*'Report '!Q13))/$I1),3)","v":0},{"$f":"ROUND(IF('Report '!$C13=\"\",\"\",SUM(('Report '!$C13*'Report '!R13))/$I1),3)","v":0},{"$f":"ROUND(IF('Report '!$C13=\"\",\"\",SUM(('Report '!$C13*'Report '!S13))/$I1),3)","v":0},{"$f":"ROUND(IF('Report '!$C13=\"\",\"\",SUM(('Report '!$C13*'Report '!T13))/$I1),3)","v":0},{"$f":"IF(G6=\"\",\"\",'Report '!B13)","v":""}]
[{"$f":"IF(B7=0,\"\",'Mix Info'!C3)","v":""},{"$f":"ROUND(IF('Report '!$C14=\"\",\"\",SUM(('Report '!$C14*'Report '!O14))/$I$1),3)","v":0},{"$f":"ROUND(IF('Report '!$C14=\"\",\"\",SUM(('Report '!$C14*'Report '!P14))/$I$1),3)","v":0},{"$f":"ROUND(IF('Report '!C14=\"\",\"\",SUM(('Report '!C14*'Report '!Q14))/$I$1),3)","v":0},{"$f":"ROUND(IF('Report '!C14=\"\",\"\",SUM(('Report '!C14*'Report '!R14))/$I$1),3)","v":0},{"$f":"ROUND(IF('Report '!C14=\"\",\"\",SUM(('Report '!C14*'Report '!S14))/$I$1),3)","v":0},{"$f":"ROUND(IF('Report '!C14=\"\",\"\",SUM(('Report '!C14*'Report '!T14))/$I$1),3)","v":0},{"$f":"IF(G7=\"\",\"\",'Report '!B14)","v":""}]
[{"$f":"IF(B8=0,\"\",'Mix Info'!D3)","v":""},{"$f":"ROUND(IF('Report '!$C15=\"\",\"\",SUM(('Report '!$C15*'Report '!O15))/$I$1),3)","v":0},{"$f":"ROUND(IF('Report '!$C15=\"\",\"\",SUM(('Report '!$C15*'Report '!P15))/$I$1),3)","v":0},{"$f":"ROUND(IF('Report '!C15=\"\",\"\",SUM(('Report '!C15*'Report '!Q15))/$I$1),3)","v":0},{"$f":"ROUND(IF('Report '!C15=\"\",\"\",SUM(('Report '!C15*'Report '!R15))/$I$1),3)","v":0},{"$f":"ROUND(IF('Report '!C15=\"\",\"\",SUM(('Report '!C15*'Report '!S15))/$I$1),3)","v":0},{"$f":"ROUND(IF('Report '!C15=\"\",\"\",SUM(('Report '!C15*'Report '!T15))/$I$1),3)","v":0},{"$f":"IF(G8=\"\",\"\",'Report '!B15)","v":""}]
[{"$f":"IF(B9=0,\"\",'Mix Info'!E3)","v":""},{"$f":"ROUND(IF('Report '!$C16=\"\",\"\",SUM(('Report '!$C16*'Report '!O16))/$I$1),3)","v":0},{"$f":"ROUND(IF('Report '!$C16=\"\",\"\",SUM(('Report '!$C16*'Report '!P16))/$I$1),3)","v":0},{"$f":"ROUND(IF('Report '!C16=\"\",\"\",SUM(('Report '!C16*'Report '!Q16))/$I$1),3)","v":0},{"$f":"ROUND(IF('Report '!C16=\"\",\"\",SUM(('Report '!C16*'Report '!R16))/$I$1),3)","v":0},{"$f":"ROUND(IF('Report '!C16=\"\",\"\",SUM(('Report '!C16*'Report '!S16))/$I$1),3)","v":0},{"$f":"ROUND(IF('Report '!C16=\"\",\"\",SUM(('Report '!C16*'Report '!T16))/$I$1),3)","v":0},{"$f":"IF(G9=\"\",\"\",'Report '!B16)","v":""}]
[{"$f":"IF(B10=0,\"\",'Mix Info'!F3)","v":""},{"$f":"ROUND(IF('Report '!$C17=\"\",\"\",SUM(('Report '!$C17*'Report '!O17))/$I$1),3)","v":0},{"$f":"ROUND(IF('Report '!$C17=\"\",\"\",SUM(('Report '!$C17*'Report '!P17))/$I$1),3)","v":0},{"$f":"ROUND(IF('Report '!C17=\"\",\"\",SUM(('Report '!C17*'Report '!Q17))/$I$1),3)","v":0},{"$f":"ROUND(IF('Report '!C17=\"\",\"\",SUM(('Report '!C17*'Report '!R17))/$I$1),3)","v":0},{"$f":"ROUND(IF('Report '!C17=\"\",\"\",SUM(('Report '!C17*'Report '!S17))/$I$1),3)","v":0},{"$f":"ROUND(IF('Report '!C17=\"\",\"\",SUM(('Report '!C17*'Report '!T17))/$I$1),3)","v":0},{"$f":"IF(G10=\"\",\"\",'Report '!B17)","v":""}]
[]
["Total Tons:  ",{"$f":"SUM(B6:B10)","v":0},0,0,0,0,0]

{"sheet":"FM Report","index":15,"n_rows":47,"n_cols":25,"rows_kept":47,"cut":false,"hidden":false,"merged":[[31,18,31,20],[31,22,31,23],[6,22,6,23],[35,2,35,13],[18,14,18,15],[6,3,6,4],[32,20,32,24],[33,20,33,24],[34,20,34,24],[35,20,35,24],[25,18,25,20],[30,18,30,20],[30,22,30,23],[25,22,25,23],[26,18,26,20],[26,22,26,23],[44,2,44,12],[42,2,42,12],[43,2,43,12],[37,18,37,22],[38,18,38,22],[39,18,39,22],[40,18,40,22],[2,3,2,4],[7,3,7,4],[3,3,3,4],[4,3,4,4],[5,3,5,4],[29,18,29,20],[29,22,29,23],[27,18,27,20],[27,22,27,23],[22,14,22,15],[28,18,28,20],[28,22,28,23]]}
[null,"800240E computer",{"$f":"Menu!D1","v":"v12.0"},"PCC Flowable Mortar & Revetment Grout Plant Report",null,null,null,null,null,null,null,null,null,null,null,null,null,null,null,null,null,null,null,{"$f":"IF('Proj Info'!$B$1=\"M\",\"M - Units\",\"E - Units\")","v":"E - Units"}]
[null,null,"C. Barko",null,null,null,null,null,null,null,null,null,null,null,null,null,null,{"$f":"IF('Proj Info'!B2=\"\",\"\",('Proj Info'!B2))","v":""},null,"Check Mix( x )",null,"Check One( x )",null,"SEND"]
[null,"Date of Placement",null,"Location",null,null,"Project No.: ",{"$f":"IF('Proj Info'!B8=\"\",\"\",'Proj Info'!B8)","v":""},null,null,null,"Contract ID: ",{"$f":"IF('Proj Info'!B13=\"\",\"\",('Proj Info'!B13))","v":""},null,null,null,"Report No.: ",{"$f":"TEXT(R2,\"00\")&\"FM\"","v":"FM"},null,"Central",{"$f":"IF('Proj Info'!$B$25=\" \",\" \",'Proj Info'!$B$25)","v":" "},"Paving",null," (Daily)"]
[null,"Mix 1",{"$f":"IF('Mix Info'!B2=\"\",\"\",IF('Mix Info'!B2=\"FM-Non Cr. Fl.\",'Mix Info'!B3,IF('Mix Info'!B2=\"FM-Cr. Fl.\",'Mix Info'!B3,(IF('Mix Info'!B2=\"GR\",'Mix Info'!B3,\"\")))))","v":""},null,null,null,"Plant Name: ",{"$f":"IF('Proj Info'!B10=\"\",\"\",('Proj Info'!B10))","v":""},null,null,null,"County: ",{"$f":"IF('Proj Info'!B14=\"\",\"\",('Proj Info'!B14))","v":""},null,null,null,"Date This Report: ",{"$f":"IF('Proj Info'!B3=\"\",\"\",('Proj Info'!B3))","v":""},null,"Ready",{"$f":"IF('Proj Info'!$B$26=\" \",\" \",'Proj Info'!$B$26)","v":" "},"Structure",null," (Weekly)"]
[null,"Mix 2",{"$f":"IF('Mix Info'!C2=\"\",\"\",IF('Mix Info'!C2=\"FM-Non Cr. Fl.\",'Mix Info'!C3,IF('Mix Info'!C2=\"FM-Cr. Fl.\",'Mix Info'!C3,(IF('Mix Info'!C2=\"GR\",'Mix Info'!C3,\"\")))))","v":""},null,null,null,"Contractor: ",{"$f":"IF('Proj Info'!B11=\"\",\"\",('Proj Info'!B11))","v":""},null,null,null,"Temp. Min: ",{"$f":"IF('Proj Info'!B6=\"\",\"\",('Proj Info'!B6))","v":""},{"$f":"IF('Proj Info'!$B$1=\"M\",'Report '!$AA$4,'Report '!$Z$4)","v":"ºF"},null,null,"Date Of Last Report: ",{"$f":"IF('Proj Info'!B4=\"\",\"\",('Proj Info'!B4))","v":""},null,null,null,"Non-structural",null," (Monthly)"]
[null,"Mix 3",{"$f":"IF('Mix Info'!D2=\"\",\"\",IF('Mix Info'!D2=\"FM-Non Cr. Fl.\",'Mix Info'!D3,IF('Mix Info'!D2=\"FM-Cr. Fl.\",'Mix Info'!D3,(IF('Mix Info'!D2=\"GR\",'Mix Info'!D3,\"\")))))","v":""},null,null,null,"SubContractor: ",{"$f":"IF('Proj Info'!B12=\"\",\"\",('Proj Info'!B12))","v":""},null,null,null,"Temp. Max: ",{"$f":"IF('Proj Info'!B7=\"\",\"\",('Proj Info'!B7))","v":""},{"$f":"IF('Proj Info'!$B$1=\"M\",'Report '!$AA$4,'Report '!$Z$4)","v":"ºF"},null,null,"Structures Des. No: ",{"$f":"IF('Proj Info'!B15=\"\",\"\",('Proj Info'!B15))","v":""},null,null,null,"Miscellaneous",{"$f":"IF(OR(B13<>\"\", B14<>\"\", B15<>\"\", B16<>\"\", B17<>\"\"), \"X\", \"\")","v":""}," (Project)"]
[null,"Mix 4",{"$f":"IF('Mix Info'!E2=\"\",\"\",IF('Mix Info'!E2=\"FM-Non Cr. Fl.\",'Mix Info'!E3,IF('Mix Info'!E2=\"FM-Cr. Fl.\",'Mix Info'!E3,(IF('Mix Info'!E2=\"GR\",'Mix Info'!E3,\"\")))))","v":""},null,null,null,"Weather: ",{"$f":"IF('Proj Info'!B5=\"\",\"\",('Proj Info'!B5))","v":""},null,null,null,null,null,null,null,null,null,null,null,null,null,null,null,"or end of Lot"]
[null,"Mix 5",{"$f":"IF('Mix Info'!F2=\"\",\"\",IF('Mix Info'!F2=\"FM-Non Cr. Fl.\",'Mix Info'!F3,IF('Mix Info'!F2=\"FM-Cr. Fl.\",'Mix Info'!F3,(IF('Mix Info'!F2=\"GR\",'Mix Info'!F3,\"\")))))","v":""}]
[]
[null,null,null,null,"Fine Aggregate",null,null,"Intermediate  Aggregate",null,null,"Coarse Aggregate",null,null,null,null,"      Actual Quantities Used -",null,null,{"$f":"IF('Proj Info'!$B$1=\"M\",'Report '!$AA$2,'Report '!$Z$2)","v":"lbs/yd3"},null,null,null,"Avg","Max"]
[null,"Mix","Batched","% Of Est.","Moist.","T-203","Wt. SSD","Moist.","T-203","Wt. SSD","Moist.","T-203","Wt. SSD",null,null,null,null,null,null,"Water",null,null,"w/c","w/c"]
[null,null,{"$f":"IF('Proj Info'!$B$1=\"M\",'Report '!$AA$1,'Report '!$Z$1)","v":"yd3"},"Used","(%)","Sp. G.",{"$f":"IF('Proj Info'!$B$1=\"M\",'Report '!$AA$3,'Report '!$Z$3)","v":"lbs"},"(%)","Sp. G.",{"$f":"IF('Proj Info'!$B$1=\"M\",'Report '!$AA$3,'Report '!$Z$3)","v":"lbs"},"(%)","Sp. G.",{"$f":"IF('Proj Info'!$B$1=\"M\",'Report '!$AA$3,'Report '!$Z$3)","v":"lbs"},"Cement","Fly Ash","GGBFS","Fine","Inter.","Coarse","In Agg.","Plant","Grade","Ratio"," Ratio"]
[1,{"$f":"IF('Mix Info'!B$2=\"\",\"\",IF('Mix Info'!B$2=\"FM-Non Cr. Fl.\",\"Non Critical Fluidity\",IF('Mix Info'!B2=\"FM-Cr. Fl.\",\"Critical Fluidity\",IF('Mix Info'!B$2=\"GR\",\"Grout\",\"\"))))","v":""},{"$f":"IF(C4=\"\",\"\",'Mix Info'!$B$19)","v":""},{"$f":"IF('Mix Info'!B20=\"\",\"\",'Mix Info'!B20)","v":""},{"$f":"IF(C4=\"\",\"\",'Mix Info'!$B$14)","v":""},{"$f":"IF(C4=\"\",\"\",'Mix Info'!$B$11)","v":""},null,null,null,null,null,null,null,null,null,null,{"$f":"IF(G13=\"\",\"\",(G13/(1-E13/100)))","v":""},null,null,{"$f":"IF(Q13=\"\",\"\",(Q13-G13)+(R13-J13)+(S13-M13))","v":""},{"$f":"IF(C4=\"\",\"\",IF('Mix Info'!$B$22=\"\",\"\",IF('Proj Info'!$B$1=\"M\",'Mix Info'!$B$22*0.5935,'Mix Info'!$B$22)))","v":""},{"$f":"IF(C4=\"\",\"\",IF('Mix Info'!$B$23=\"\",\"\",IF('Proj Info'!$B$1=\"M\",'Mix Info'!$B$23*0.5935,'Mix Info'!$B$23)))","v":""},null,null,{"$f":"IF('Mix Info'!B2=\"\",\"\",'Mix Info'!B2)","v":""}]
[2,{"$f":"IF('Mix Info'!C$2=\"\",\"\",IF('Mix Info'!C$2=\"FM-Non Cr. Fl.\",\"Non Critical Fluidity\",IF('Mix Info'!C2=\"FM-Cr. Fl.\",\"Critical Fluidity\",IF('Mix Info'!C$2=\"GR\",\"Grout\",\"\"))))","v":""},{"$f":"IF(C5=\"\",\"\",'Mix Info'!$C$19)","v":""},{"$f":"IF('Mix Info'!C20=\"\",\"\",'Mix Info'!C20)","v":""},{"$f":"IF(C5=\"\",\"\",'Mix Info'!$C$14)","v":""},{"$f":"IF(C5=\"\",\"\",'Mix Info'!$C$11)","v":""},null,null,null,null,null,null,null,null,null,null,{"$f":"IF(G14=\"\",\"\",(G14/(1-E14/100)))","v":""},null,null,{"$f":"IF(Q14=\"\",\"\",(Q14-G14)+(R14-J14)+(S14-M14))","v":""},{"$f":"IF(C5=\"\",\"\",IF('Mix Info'!$C$22=\"\",\"\",IF('Proj Info'!$B$1=\"M\",'Mix Info'!$C$22*0.5935,'Mix Info'!$C$22)))","v":""},{"$f":"IF(C5=\"\",\"\",IF('Mix Info'!$C$23=\"\",\"\",IF('Proj Info'!$B$1=\"M\",'Mix Info'!$C$23*0.5935,'Mix Info'!$C$23)))","v":""},null,null,{"$f":"IF('Mix Info'!C2=\"\",\"\",'Mix Info'!C2)","v":""}]
[3,{"$f":"IF('Mix Info'!D$2=\"\",\"\",IF('Mix Info'!D$2=\"FM-Non Cr. Fl.\",\"Non Critical Fluidity\",IF('Mix Info'!D2=\"FM-Cr. Fl.\",\"Critical Fluidity\",IF('Mix Info'!D$2=\"GR\",\"Grout\",\"\"))))","v":""},{"$f":"IF(C6=\"\",\"\",'Mix Info'!$D$19)","v":""},{"$f":"IF('Mix Info'!D20=\"\",\"\",'Mix Info'!D20)","v":""},{"$f":"IF(C6=\"\",\"\",'Mix Info'!$D$14)","v":""},{"$f":"IF(C6=\"\",\"\",'Mix Info'!$D$11)","v":""},null,null,null,null,null,null,null,null,null,null,{"$f":"IF(G15=\"\",\"\",(G15/(1-E15/100)))","v":""},null,null,{"$f":"IF(Q15=\"\",\"\",(Q15-G15)+(R15-J15)+(S15-M15))","v":""},{"$f":"IF(C6=\"\",\"\",IF('Mix Info'!$D$22=\"\",\"\",IF('Proj Info'!$B$1=\"M\",'Mix Info'!$D$22*0.5935,'Mix Info'!$D$22)))","v":""},{"$f":"IF(C6=\"\",\"\",IF('Mix Info'!$D$23=\"\",\"\",IF('Proj Info'!$B$1=\"M\",'Mix Info'!$D$23*0.5935,'Mix Info'!$D$23)))","v":""},null,null,{"$f":"IF('Mix Info'!D2=\"\",\"\",'Mix Info'!D2)","v":""}]
[4,{"$f":"IF('Mix Info'!E$2=\"\",\"\",IF('Mix Info'!E$2=\"FM-Non Cr. Fl.\",\"Non Critical Fluidity\",IF('Mix Info'!E2=\"FM-Cr. Fl.\",\"Critical Fluidity\",IF('Mix Info'!E$2=\"GR\",\"Grout\",\"\"))))","v":""},{"$f":"IF(C7=\"\",\"\",'Mix Info'!$E$19)","v":""},{"$f":"IF('Mix Info'!E20=\"\",\"\",'Mix Info'!E20)","v":""},{"$f":"IF(C7=\"\",\"\",'Mix Info'!$E$14)","v":""},{"$f":"IF(C7=\"\",\"\",'Mix Info'!$E$11)","v":""},null,null,null,null,null,null,null,null,null,null,{"$f":"IF(G16=\"\",\"\",(G16/(1-E16/100)))","v":""},null,null,{"$f":"IF(Q16=\"\",\"\",(Q16-G16)+(R16-J16)+(S16-M16))","v":""},{"$f":"IF(C7=\"\",\"\",IF('Mix Info'!$E$22=\"\",\"\",IF('Proj Info'!$B$1=\"M\",'Mix Info'!$E$22*0.5935,'Mix Info'!$E$22)))","v":""},{"$f":"IF(C7=\"\",\"\",IF('Mix Info'!$E$23=\"\",\"\",IF('Proj Info'!$B$1=\"M\",'Mix Info'!$E$23*0.5935,'Mix Info'!$E$23)))","v":""},null,null,{"$f":"IF('Mix Info'!E2=\"\",\"\",'Mix Info'!E2)","v":""}]
[5,{"$f":"IF('Mix Info'!F$2=\"\",\"\",IF('Mix Info'!F$2=\"FM-Non Cr. Fl.\",\"Non Critical Fluidity\",IF('Mix Info'!F2=\"FM-Cr. Fl.\",\"Critical Fluidity\",IF('Mix Info'!F$2=\"GR\",\"Grout\",\"\"))))","v":""},{"$f":"IF(C8=\"\",\"\",'Mix Info'!$F$19)","v":""},{"$f":"IF('Mix Info'!F20=\"\",\"\",'Mix Info'!F20)","v":""},{"$f":"IF(C8=\"\",\"\",'Mix Info'!$F$14)","v":""},{"$f":"IF(C8=\"\",\"\",'Mix Info'!$F$11)","v":""},null,null,null,null,null,null,null,null,null,null,{"$f":"IF(G17=\"\",\"\",(G17/(1-E17/100)))","v":""},null,null,{"$f":"IF(Q17=\"\",\"\",(Q17-G17)+(R17-J17)+(S17-M17))","v":""},{"$f":"IF(C8=\"\",\"\",IF('Mix Info'!$F$22=\"\",\"\",IF('Proj Info'!$B$1=\"M\",'Mix Info'!$F$22*0.5935,'Mix Info'!$F$22)))","v":""},{"$f":"IF(C8=\"\",\"\",IF('Mix Info'!$F$23=\"\",\"\",IF('Proj Info'!$B$1=\"M\",'Mix Info'!$F$23*0.5935,'Mix Info'!$F$23)))","v":""},null,null,{"$f":"IF('Mix Info'!F2=\"\",\"\",'Mix Info'!F2)","v":""}]
[]
[null,null,"Coarse",null,{"$f":"IF('Proj Info'!$B$1=\"M\",'Report '!$AA$6,'Report '!$Z$6)","v":"1  1/2\""},{"$f":"IF('Proj Info'!$B$1=\"M\",'Report '!$AA$7,'Report '!$Z$7)","v":"1\""},{"$f":"IF('Proj Info'!$B$1=\"M\",'Report '!$AA$8,'Report '!$Z$8)","v":"3/4\""},{"$f":"IF('Proj Info'!$B$1=\"M\",'Report '!$AA$9,'Report '!$Z$9)","v":"1/2\""},{"$f":"IF('Proj Info'!$B$1=\"M\",'Report '!$AB$10,'Report '!$AA$10)","v":"3/8\""},{"$f":"IF('Proj Info'!$B$1=\"M\",'Report '!$AB$11,'Report '!$AA$11)","v":"#4"},{"$f":"IF('Proj Info'!$B$1=\"M\",'Report '!$AB$12,'Report '!$AA$12)","v":"#8"},{"$f":"IF('Proj Info'!$B$1=\"M\",'Report '!$AB$17,'Report '!$AA$17)","v":"#200"},"Comply",null,"Conc. Treatment",null,"(X)",{"$f":"IF('Proj Info'!$B$1=\"M\",'Report '!$AA$2,'Report '!$Z$2)","v":"lbs/yd3"},null,"Batched"]
[null,null,{"$f":"IF('Mix Info'!H5=\"\",\"\",('Mix Info'!H5))","v":""},null,null,null,null,null,null,null,null,null,"Y/N",null,"           Ice ",null,{"$f":"IF('Proj Info'!$B$73=\"\",\"\",\"X\")","v":""},{"$f":"IF('Proj Info'!$B$74=\"\",\"\",IF('Proj Info'!$B$1=\"M\",('Proj Info'!$B$74*0.5935),'Proj Info'!$B$74))","v":""},null,null,null,null,"Week","Total"]
[null,null,null,null,null,null,null,null,null,null,null,null,null,null,"Heated Water ",null,{"$f":"IF('Proj Info'!$B$75=\"\",\"\",\"X\")","v":""},null,null,"Check One (X)",null,null,{"$f":"IF(W6=\"\",\"\",W6)","v":""},"To Date"]
[null,null,null,null,null,null,null,null,null,null,null,null,null,null,"Heated Materials ",null,{"$f":"IF('Proj Info'!$B$76=\"\",\"\",\"X\")","v":""},null,null,"Concrete:  ",{"$f":"IF('Proj Info'!$B$1=\"M\",'Report '!$AA$1,'Report '!$Z$1)","v":"yd3"},null,{"$f":"IF(W21=\"X\",SUM(C13:C17),\"\")","v":""}]
[null,null,null,null,null,null,null,null,null,null,null,null,null,null,"Liquid Nitrogen",null,{"$f":"IF('Proj Info'!$B$77=\"\",\"\",\"X\")","v":""},null,null,"Cement:  ",{"$f":"IF('Proj Info'!$B$1=\"M\",'Report '!$AA$5,'Report '!$Z$5)","v":"tons"},null,{"$f":"IF(W21=\"X\",(((C13*N13)+(C14*N14)+(C15*N15)+(C16*N16)+(C17*N17))/'Report '!Z18),\" \")","v":" "}]
[]
[null,null,"Intermediate",null,{"$f":"IF('Proj Info'!$B$1=\"M\",'Report '!$AA$6,'Report '!$Z$6)","v":"1  1/2\""},{"$f":"IF('Proj Info'!$B$1=\"M\",'Report '!$AA$7,'Report '!$Z$7)","v":"1\""},{"$f":"IF('Proj Info'!$B$1=\"M\",'Report '!$AA$8,'Report '!$Z$8)","v":"3/4\""},{"$f":"IF('Proj Info'!$B$1=\"M\",'Report '!$AA$9,'Report '!$Z$9)","v":"1/2\""},{"$f":"IF('Proj Info'!$B$1=\"M\",'Report '!$AB$10,'Report '!$AA$10)","v":"3/8\""},{"$f":"IF('Proj Info'!$B$1=\"M\",'Report '!$AB$11,'Report '!$AA$11)","v":"#4"},{"$f":"IF('Proj Info'!$B$1=\"M\",'Report '!$AB$12,'Report '!$AA$12)","v":"#8"},{"$f":"IF('Proj Info'!$B$1=\"M\",'Report '!$AB$17,'Report '!$AA$17)","v":"#200"},"Comply",null,null,null,null,null,"Brand / Source",null,null,"Rate","     Lot Number"]
[null,null,{"$f":"IF('Mix Info'!H6=\"\",\"\",'Mix Info'!H6)","v":""},null,null,null,null,null,null,null,null,null,null,null,null,null,null,"Air Entraining:  ",{"$f":"IF(AND('Proj Info'!B48=\"\",'Proj Info'!C48=\"\"),\"\",IF('Proj Info'!B48<>\"\", 'Proj Info'!B48, 'Proj Info'!C48))","v":""},null,null,{"$f":"IF(AND('Proj Info'!B49=\"\",'Proj Info'!C49=\"\"),\"\",IF('Proj Info'!B49<>\"\", 'Proj Info'!B49, 'Proj Info'!C49))","v":""},{"$f":"IF(AND('Proj Info'!B50=\"\",'Proj Info'!C50=\"\"),\"\",IF('Proj Info'!B50<>\"\", 'Proj Info'!B50, 'Proj Info'!C50))","v":""}]
[null,null,null,null,null,null,null,null,null,null,null,null,null,null,null,null,null,"Normal Water Reducer:  ",{"$f":"IF(AND('Proj Info'!B51=\"\",'Proj Info'!C51=\"\"),\"\",IF('Proj Info'!B51<>\"\", 'Proj Info'!B51, 'Proj Info'!C51))","v":""},null,null,{"$f":"IF(AND('Proj Info'!B52=\"\",'Proj Info'!C52=\"\"),\"\",IF('Proj Info'!B52<>\"\", 'Proj Info'!B52, 'Proj Info'!C52))","v":""},{"$f":"IF(AND('Proj Info'!B53=\"\",'Proj Info'!C53=\"\"),\"\",IF('Proj Info'!B53<>\"\", 'Proj Info'!B53, 'Proj Info'!C53))","v":""}]
[null,null,null,null,null,null,null,null,null,null,null,null,null,null,null,null,null,"             Mid-Range Water Reducer:  ",{"$f":"IF(AND('Proj Info'!B54=\"\",'Proj Info'!C54=\"\"),\"\",IF('Proj Info'!B54<>\"\", 'Proj Info'!B54, 'Proj Info'!C54))","v":""},null,null,{"$f":"IF(AND('Proj Info'!B55=\"\",'Proj Info'!C55=\"\"),\"\",IF('Proj Info'!B55<>\"\", 'Proj Info'!B55, 'Proj Info'!C55))","v":""},{"$f":"IF(AND('Proj Info'!B56=\"\",'Proj Info'!C56=\"\"),\"\",IF('Proj Info'!B56<>\"\", 'Proj Info'!B56, 'Proj Info'!C56))","v":""}]
[null,null,null,null,null,null,null,null,null,null,null,null,null,null,null,null,null,"High-Range Water Reducer:  ",{"$f":"IF(AND('Proj Info'!B57=\"\",'Proj Info'!C57=\"\"),\"\",IF('Proj Info'!B57<>\"\", 'Proj Info'!B57, 'Proj Info'!C57))","v":""},null,null,{"$f":"IF(AND('Proj Info'!B58=\"\",'Proj Info'!C58=\"\"),\"\",IF('Proj Info'!B58<>\"\", 'Proj Info'!B58, 'Proj Info'!C58))","v":""},{"$f":"IF(AND('Proj Info'!B59=\"\",'Proj Info'!C59=\"\"),\"\",IF('Proj Info'!B59<>\"\", 'Proj Info'!B59, 'Proj Info'!C59))","v":""}]
[null,null,"Fine",{"$f":"IF('Proj Info'!$B$1=\"M\",'Report '!$AA$9,'Report '!$Z$9)","v":"1/2\""},{"$f":"IF('Proj Info'!$B$1=\"M\",'Report '!$AB$10,'Report '!$AA$10)","v":"3/8\""},{"$f":"IF('Proj Info'!$B$1=\"M\",'Report '!$AB$11,'Report '!$AA$11)","v":"#4"},{"$f":"IF('Proj Info'!$B$1=\"M\",'Report '!$AB$12,'Report '!$AA$12)","v":"#8"},{"$f":"IF('Proj Info'!$B$1=\"M\",'Report '!$AB$13,'Report '!$AA$13)","v":"#16"},{"$f":"IF('Proj Info'!$B$1=\"M\",'Report '!$AB$14,'Report '!$AA$14)","v":"#30"},{"$f":"IF('Proj Info'!$B$1=\"M\",'Report '!$AB$15,'Report '!$AA$15)","v":"#50"},{"$f":"IF('Proj Info'!$B$1=\"M\",'Report '!$AB$16,'Report '!$AA$16)","v":"#100"},{"$f":"IF('Proj Info'!$B$1=\"M\",'Report '!$AB$17,'Report '!$AA$17)","v":"#200"},"Comply",null,null,null,null,"Retarder:  ",{"$f":"IF(AND('Proj Info'!B60=\"\",'Proj Info'!C60=\"\"),\"\",IF('Proj Info'!B60<>\"\", 'Proj Info'!B60, 'Proj Info'!C60))","v":""},null,null,{"$f":"IF(AND('Proj Info'!B61=\"\",'Proj Info'!C61=\"\"),\"\",IF('Proj Info'!B61<>\"\", 'Proj Info'!B61, 'Proj Info'!C61))","v":""},{"$f":"IF(AND('Proj Info'!B62=\"\",'Proj Info'!C62=\"\"),\"\",IF('Proj Info'!B62<>\"\", 'Proj Info'!B62, 'Proj Info'!C62))","v":""}]
[null,"SampleDate:",null,null,{"$f":"IF('Proj Info'!$B$104=\" \",\" \",'Proj Info'!$B$104)","v":""},{"$f":"IF('Proj Info'!$B$105=\" \",\" \",'Proj Info'!$B$105)","v":""},{"$f":"IF('Proj Info'!$B$106=\" \",\" \",'Proj Info'!$B$106)","v":""},null,{"$f":"IF('Proj Info'!$B$107=\" \",\" \",'Proj Info'!$B$107)","v":""},null,null,{"$f":"IF('Proj Info'!$B$108=\" \",\" \",'Proj Info'!$B$108)","v":""},"Y/N",null,null,null,null,"    Special Performance Admixturer:  ",{"$f":"IF(AND('Proj Info'!B63=\"\",'Proj Info'!C63=\"\"),\"\",IF('Proj Info'!B63<>\"\", 'Proj Info'!B63, 'Proj Info'!C63))","v":""},null,null,{"$f":"IF(AND('Proj Info'!B64=\"\",'Proj Info'!C64=\"\"),\"\",IF('Proj Info'!B64<>\"\", 'Proj Info'!B64, 'Proj Info'!C64))","v":""},{"$f":"IF(AND('Proj Info'!B65=\"\",'Proj Info'!C65=\"\"),\"\",IF('Proj Info'!B65<>\"\", 'Proj Info'!B65, 'Proj Info'!C65))","v":""}]
[null,{"$f":"IF('Grad 1'!B40=\"\",\"\",'Grad 1'!B40)","v":""},{"$f":"IF('Grad 1'!$B$39=\" \",\" \",'Grad 1'!$B$39)","v":" "},{"$f":"IF(E32=100,\"\",IF('Grad 1'!$I$43=\" \",\" \",'Grad 1'!$I$43))","v":" "},{"$f":"IF('Grad 1'!$I$44=\" \",\" \",'Grad 1'!$I$44)","v":" "},{"$f":"IF('Grad 1'!$I$45=\" \",\" \",'Grad 1'!$I$45)","v":" "},{"$f":"IF('Grad 1'!$I$46=\" \",\" \",'Grad 1'!$I$46)","v":" "},{"$f":"IF('Grad 1'!$I$47=\" \",\" \",'Grad 1'!$I$47)","v":" "},{"$f":"IF('Grad 1'!$I$48=\" \",\" \",'Grad 1'!$I$48)","v":" "},{"$f":"IF('Grad 1'!$I$49=\" \",\" \",'Grad 1'!$I$49)","v":" "},{"$f":"IF('Grad 1'!$I$50=\" \",\" \",'Grad 1'!$I$50)","v":" "},{"$f":"IF('Grad 1'!$I$51=\" \",\" \",'Grad 1'!$I$51)","v":" "},{"$f":"IF(AND('Grad 1'!B41>0, OR('Grad 1'!$B$54=\"Y\",'Grad 1'!B54=\"N\")),'Grad 1'!$B$54,\"\")","v":""},null,null,null,null,"Flowable Fill Admixture:  ",{"$f":"IF(AND('Proj Info'!B66=\"\",'Proj Info'!C66=\"\"),\"\",IF('Proj Info'!B66<>\"\", 'Proj Info'!B66, 'Proj Info'!C66))","v":""},null,null,{"$f":"IF(AND('Proj Info'!B67=\"\",'Proj Info'!C67=\"\"),\"\",IF('Proj Info'!B67<>\"\", 'Proj Info'!B67, 'Proj Info'!C67))","v":""},{"$f":"IF(AND('Proj Info'!B68=\"\",'Proj Info'!C68=\"\"),\"\",IF('Proj Info'!B68<>\"\", 'Proj Info'!B68, 'Proj Info'!C68))","v":""}]
[null,{"$f":"IF('Grad 2'!B40=\"\",\"\",'Grad 2'!B40)","v":""},{"$f":"IF('Grad 2'!$B$39=\" \",\" \",'Grad 2'!$B$39)","v":" "},{"$f":"IF(E33=100,\"\",IF('Grad 2'!$I$43=\" \",\" \",'Grad 2'!$I$43))","v":" "},{"$f":"IF('Grad 2'!$I$44=\" \",\" \",'Grad 2'!$I$44)","v":" "},{"$f":"IF('Grad 2'!$I$45=\" \",\" \",'Grad 2'!$I$45)","v":" "},{"$f":"IF('Grad 2'!$I$46=\" \",\" \",'Grad 2'!$I$46)","v":" "},{"$f":"IF('Grad 2'!$I$47=\" \",\" \",'Grad 2'!$I$47)","v":" "},{"$f":"IF('Grad 2'!$I$48=\" \",\" \",'Grad 2'!$I$48)","v":" "},{"$f":"IF('Grad 2'!$I$49=\" \",\" \",'Grad 2'!$I$49)","v":" "},{"$f":"IF('Grad 2'!$I$50=\" \",\" \",'Grad 2'!$I$50)","v":" "},{"$f":"IF('Grad 2'!$I$51=\" \",\" \",'Grad 2'!$I$51)","v":" "},{"$f":"IF(AND('Grad 2'!B41>0, OR('Grad 2'!$B$54=\"Y\",'Grad 2'!B54=\"N\")),'Grad 2'!$B$54,\"\")","v":""},null,null,null,null,null,"Type","Sp. Gr.","Source"]
[null,{"$f":"IF('Grad 3'!B40=\"\",\"\",'Grad 3'!B40)","v":""},{"$f":"IF('Grad 3'!$B$39=\" \",\" \",'Grad 3'!$B$39)","v":" "},{"$f":"IF(E34=100,\"\",IF('Grad 3'!$I$43=\" \",\" \",'Grad 3'!$I$43))","v":" "},{"$f":"IF('Grad 3'!$I$44=\" \",\" \",'Grad 3'!$I$44)","v":" "},{"$f":"IF('Grad 3'!$I$45=\" \",\" \",'Grad 3'!$I$45)","v":" "},{"$f":"IF('Grad 3'!$I$46=\" \",\" \",'Grad 3'!$I$46)","v":" "},{"$f":"IF('Grad 3'!$I$47=\" \",\" \",'Grad 3'!$I$47)","v":" "},{"$f":"IF('Grad 3'!$I$48=\" \",\" \",'Grad 3'!$I$48)","v":" "},{"$f":"IF('Grad 3'!$I$49=\" \",\" \",'Grad 3'!$I$49)","v":" "},{"$f":"IF('Grad 3'!$I$50=\" \",\" \",'Grad 3'!$I$50)","v":" "},{"$f":"IF('Grad 3'!$I$51=\" \",\" \",'Grad 3'!$I$51)","v":" "},{"$f":"IF(AND('Grad 3'!B41>0, OR('Grad 3'!$B$54=\"Y\",'Grad 3'!B54=\"N\")), 'Grad 3'!$B$54,\"\")","v":""},null,null,null,null,"Cement:  ",{"$f":"IF(AND('Proj Info'!B34=\"\", 'Proj Info'!C34=\"\"), \"\", IF('Proj Info'!B34<>\"\", 'Proj Info'!B34,'Proj Info'!C34))","v":""},{"$f":"IF(AND('Proj Info'!B35=\"\", 'Proj Info'!C35=\"\"), \"\", IF('Proj Info'!B35<>\"\", 'Proj Info'!B35,'Proj Info'!C35))","v":""},{"$f":"IF(AND('Proj Info'!B33=\"\", 'Proj Info'!C33=\"\"), \"\", IF('Proj Info'!B33<>\"\", 'Proj Info'!B33,'Proj Info'!C33))","v":""}]
[null,null,null,null,null,null,null,null,null,null,null,null,null,null,null,null,null,"Fly Ash:  ",{"$f":"IF(AND('Proj Info'!B37=\"\", 'Proj Info'!C37=\"\"), \"\", IF('Proj Info'!B37<>\"\", 'Proj Info'!B37,'Proj Info'!C37))","v":""},{"$f":"IF(AND('Proj Info'!B38=\"\", 'Proj Info'!C38=\"\"), \"\", IF('Proj Info'!B38<>\"\", 'Proj Info'!B38,'Proj Info'!C38))","v":""},{"$f":"IF(AND('Proj Info'!B36=\"\", 'Proj Info'!C36=\"\"), \"\", IF('Proj Info'!B36<>\"\", 'Proj Info'!B36,'Proj Info'!C36))","v":""}]
[null,null,"Adjusted % Passing Calculated Combined Gradation",null,null,null,null,null,null,null,null,null,null,null,null,null,null,"GGBFS:  ",{"$f":"IF(AND('Proj Info'!B40=\"\", 'Proj Info'!C40=\"\"), \"\", IF('Proj Info'!B40<>\"\", 'Proj Info'!B40,'Proj Info'!C40))","v":""},{"$f":"IF(AND('Proj Info'!B41=\"\", 'Proj Info'!C41=\"\"), \"\", IF('Proj Info'!B41<>\"\", 'Proj Info'!B41,'Proj Info'!C41))","v":""},{"$f":"IF(AND('Proj Info'!B39=\"\", 'Proj Info'!C39=\"\"), \"\", IF('Proj Info'!B39<>\"\", 'Proj Info'!B39,'Proj Info'!C39))","v":""}]
[null,null,{"$f":"IF('Proj Info'!$B$1=\"M\",'Report '!$AA$6,'Report '!$Z$6)","v":"1  1/2\""},{"$f":"IF('Proj Info'!$B$1=\"M\",'Report '!$AA$7,'Report '!$Z$7)","v":"1\""},{"$f":"IF('Proj Info'!$B$1=\"M\",'Report '!$AA$8,'Report '!$Z$8)","v":"3/4\""},{"$f":"IF('Proj Info'!$B$1=\"M\",'Report '!$AA$9,'Report '!$Z$9)","v":"1/2\""},{"$f":"IF('Proj Info'!$B$1=\"M\",'Report '!$AB$10,'Report '!$AA$10)","v":"3/8\""},{"$f":"IF('Proj Info'!$B$1=\"M\",'Report '!$AB$11,'Report '!$AA$11)","v":"#4"},{"$f":"IF('Proj Info'!$B$1=\"M\",'Report '!$AB$12,'Report '!$AA$12)","v":"#8"},{"$f":"IF('Proj Info'!$B$1=\"M\",'Report '!$AB$13,'Report '!$AA$13)","v":"#16"},{"$f":"IF('Proj Info'!$B$1=\"M\",'Report '!$AB$14,'Report '!$AA$14)","v":"#30"},{"$f":"IF('Proj Info'!$B$1=\"M\",'Report '!$AB$15,'Report '!$AA$15)","v":"#50"},{"$f":"IF('Proj Info'!$B$1=\"M\",'Report '!$AB$16,'Report '!$AA$16)","v":"#100"},{"$f":"IF('Proj Info'!$B$1=\"M\",'Report '!$AB$17,'Report '!$AA$17)","v":"#200"},"Within"]
[null,"Target",null,null,null,null,null,null,null,null,null,null,null,null,null,null,null,null,"T-203 A # & Source",null,null,null,null,"Grad. No."]
[null,null,null,null,null,null,null,null,null,null,null,null,null,null,null,null,null,"Coarse:  ",{"$f":"IF(AND('Proj Info'!B42=\"\",'Proj Info'!C42=\"\"),\"\",IF('Proj Info'!B42<>\"\",'Proj Info'!B42,'Proj Info'!C42))","v":""},null,null,null,null,{"$f":"IF('Proj Info'!$B$43=\"\",\"\",'Proj Info'!$B$43)","v":""}]
[null,null,null,null,null,null,null,null,null,null,null,null,null,null,null,null,null,"Intermediate:  ",{"$f":"IF(AND('Proj Info'!B44=\"\",'Proj Info'!C44=\"\"),\"\",IF('Proj Info'!B44<>\"\",'Proj Info'!B44,'Proj Info'!C44))","v":""},null,null,null,null,{"$f":"IF('Proj Info'!$B$45=\"\",\"\",'Proj Info'!$B$45)","v":""}]
[null,null,null,null,null,null,null,null,null,null,null,null,null,null,null,null,null,"Fine:  ",{"$f":"IF(AND('Proj Info'!B46=\"\",'Proj Info'!C46=\"\"),\"\",IF('Proj Info'!B46<>\"\",'Proj Info'!B46,'Proj Info'!C46))","v":""},null,null,null,null,{"$f":"IF('Proj Info'!$B$47=\"\",\"\",'Proj Info'!$B$47)","v":""}]
[]
[null,"Remarks"]
[]
[]
[null,null,null,null,null,null,null,null,null,null,null,null,null,null,null,"C.P.I.: ",{"$f":"IF('Proj Info'!B78=\"\",\"\",('Proj Info'!B78))","v":""},null,null,null,null,{"$f":"IF('Proj Info'!B79=\"\",\"\",('Proj Info'!B79))","v":""}]
[null,null,"Distribution:     _____   DME     _____   Proj. Eng.     _____   Plant",null,null,null,null,null,null,null,null,null,null,null,null,"Monitor: ",{"$f":"IF('Proj Info'!B84=\"\",\"\",('Proj Info'!B84))","v":""},null,null,null,null,{"$f":"IF('Proj Info'!B85=\"\",\"\",('Proj Info'!B85))","v":""}]

{"sheet":"FM Summary","index":16,"n_rows":12,"n_cols":9,"rows_kept":12,"cut":false,"hidden":false,"merged":[]}
["Material Production Summary - Flowable Mortar & Revetment Grout",null,null,null,null,null,null,null,{"$f":"IF('Proj Info'!$B$1=\"M\",1000,2000)","v":2000}]
[]
[null,null,null,null,"Fine","Intermediate","Coarse"]
[null,"Cement","Fly Ash","GGBFS","Aggregate","Aggregate","Aggregate","Mix"]
["Date",{"$f":"'FM Report'!$U$23","v":"tons"},{"$f":"'FM Report'!$U$23","v":"tons"},{"$f":"'FM Report'!$U$23","v":"tons"},{"$f":"'FM Report'!$U$23","v":"tons"},{"$f":"'FM Report'!$U$23","v":"tons"},{"$f":"'FM Report'!$U$23","v":"tons"},"Identification"]
[{"$f":"IF('FM Report'!C4=\"\",\"\",'FM Report'!C4)","v":""},{"$f":"ROUND(IF('FM Report'!$C13=\"\",\"\",SUM(('FM Report'!$C13*'FM Report'!N13))/$I$1),2)","v":0},{"$f":"ROUND(IF('FM Report'!$C13=\"\",\"\",SUM(('FM Report'!$C13*'FM Report'!O13))/$I$1),2)","v":0},null,{"$f":"ROUND(IF('FM Report'!$C13=\"\",\"\",SUM(('FM Report'!$C13*'FM Report'!Q13))/$I$1),2)","v":0},null,null,{"$f":"IF('FM Report'!B13=\"\",\"\",'FM Report'!B13)","v":""}]
[{"$f":"IF('FM Report'!C5=\"\",\"\",'FM Report'!C5)","v":""},{"$f":"ROUND(IF('FM Report'!$C14=\"\",\"\",SUM(('FM Report'!$C14*'FM Report'!N14))/$I$1),2)","v":0},{"$f":"ROUND(IF('FM Report'!$C14=\"\",\"\",SUM(('FM Report'!$C14*'FM Report'!O14))/$I$1),2)","v":0},null,{"$f":"ROUND(IF('FM Report'!$C14=\"\",\"\",SUM(('FM Report'!$C14*'FM Report'!Q14))/$I$1),2)","v":0},null,null,{"$f":"IF('FM Report'!B14=\"\",\"\",'FM Report'!B14)","v":""}]
[{"$f":"IF('FM Report'!C6=\"\",\"\",'FM Report'!C6)","v":""},{"$f":"ROUND(IF('FM Report'!$C15=\"\",\"\",SUM(('FM Report'!$C15*'FM Report'!N15))/$I$1),2)","v":0},{"$f":"ROUND(IF('FM Report'!$C15=\"\",\"\",SUM(('FM Report'!$C15*'FM Report'!O15))/$I$1),2)","v":0},null,{"$f":"ROUND(IF('FM Report'!$C15=\"\",\"\",SUM(('FM Report'!$C15*'FM Report'!Q15))/$I$1),2)","v":0},null,null,{"$f":"IF('FM Report'!B15=\"\",\"\",'FM Report'!B15)","v":""}]
[{"$f":"IF('FM Report'!C7=\"\",\"\",'FM Report'!C7)","v":""},{"$f":"ROUND(IF('FM Report'!$C16=\"\",\"\",SUM(('FM Report'!$C16*'FM Report'!N16))/$I$1),2)","v":0},{"$f":"ROUND(IF('FM Report'!$C16=\"\",\"\",SUM(('FM Report'!$C16*'FM Report'!O16))/$I$1),2)","v":0},null,{"$f":"ROUND(IF('FM Report'!$C16=\"\",\"\",SUM(('FM Report'!$C16*'FM Report'!Q16))/$I$1),2)","v":0},null,null,{"$f":"IF('FM Report'!B16=\"\",\"\",'FM Report'!B16)","v":""}]
[{"$f":"IF('FM Report'!C8=\"\",\"\",'FM Report'!C8)","v":""},{"$f":"ROUND(IF('FM Report'!$C17=\"\",\"\",SUM(('FM Report'!$C17*'FM Report'!N17))/$I$1),2)","v":0},{"$f":"ROUND(IF('FM Report'!$C17=\"\",\"\",SUM(('FM Report'!$C17*'FM Report'!O17))/$I$1),2)","v":0},null,{"$f":"ROUND(IF('FM Report'!$C17=\"\",\"\",SUM(('FM Report'!$C17*'FM Report'!Q17))/$I$1),2)","v":0},null,null,{"$f":"IF('FM Report'!B17=\"\",\"\",'FM Report'!B17)","v":""}]
[]
["Total Tons:  ",{"$f":"SUM(B6:B10)","v":0},0,0,0,0,0]

{"sheet":"Diary","index":17,"n_rows":46,"n_cols":8,"rows_kept":46,"cut":false,"hidden":false,"merged":[]}
["Daily Diary"]
[]
["Date: ",{"$f":"IF('Proj Info'!$B$3=\"\",\"\",('Proj Info'!$B$3))","v":""}]
["High: ",{"$f":"IF('Report '!M6=\"\",\"\",('Report '!M6))","v":""}]
["Low: ",{"$f":"IF('Report '!M5=\"\",\"\",('Report '!M5))","v":""},null,null,null,"Project No.: ",{"$f":"IF('Proj Info'!$B$8=\"\",\"\",('Proj Info'!$B$8))","v":""}]
["Weather: ",{"$f":"IF('Report '!H7=\"\",\"\",('Report '!H7))","v":""},null,null,null,"Contract ID: ",{"$f":"IF('Proj Info'!$B$13=\"\",\"\",('Proj Info'!$B$13))","v":""}]
[]
[]
[]
[]
[]
[]
[]
[]
[]
[]
[]
[]
[]
[]
[]
[]
[]
[]
[]
[]
[]
[]
[]
[]
[]
[]
[]
[]
[]
[]
[]
[]
[]
[]
[]
[]
[]
["Daily Diary",null,null,null,null,null,null,"Page 2"]
[]
["Date: ",{"$f":"IF('Proj Info'!$B$3=\"\",\"\",('Proj Info'!$B$3))","v":""}]

{"sheet":"Paving History","index":18,"n_rows":30,"n_cols":13,"rows_kept":30,"cut":false,"hidden":true,"merged":[[27,1,27,12],[28,0,28,12],[29,0,29,2],[13,9,15,10],[13,11,15,11],[13,12,15,12],[23,0,23,1],[25,1,25,5],[25,7,25,8],[25,9,25,12],[13,0,15,1],[13,2,15,2],[13,3,15,3],[13,4,15,4],[13,5,15,6],[13,7,15,8],[4,11,4,12],[6,1,6,12],[12,4,12,6],[0,3,0,9],[4,1,4,3],[4,5,4,6],[4,8,4,9],[8,1,8,3],[8,5,8,7],[8,9,8,10],[10,1,10,5],[10,8,10,12]]}
[null,null,null,"Portland Cement Concrete Pavement history"]
[]
[]
[]
["Project No.:",null,null,null,"County:",null,null,"Start Date:",null,null,"Complete Date:"]
[]
["Location:"]
[]
["From MP/Sta.:",null,null,null,"To MP/Sta.:",null,null,null,"Length:",null,null,"Depth/in:                 "]
[]
["Contractor:",null,null,null,null,null,null,"RCE:"]
[]
[null,null,null,null,"Materials Information"]
["Station to station",null,"Cement Source ","Flyash source","GGBFS Source","T-203 Fine aggregate& Source",null,"T-203 Intermediate Aggregate & Source",null,"T-203 Coarse Aggregate & Source",null,"Coarce Agg. Bed No.s","Mix Type"]
[]
[]
[]
[]
[]
[]
[]
[]
[]
[]
[]
["Air Agent Brand:",null,null,null,null,null,null,"Water Reducer/Retarder:"]
[]
["Comments:"]
[]
["Copies:Dist. Matls. Engineer, PCC Materials engineer, Central Geology"]

{"sheet":"CA","index":19,"n_rows":325,"n_cols":4,"rows_kept":325,"cut":false,"hidden":true,"merged":[[0,0,1,3]]}
["Coarse Aggregate Source Information"]
[]
[]
["A03002-WEXFORD","A03002","WEXFORD"]
[{"$f":"CONCATENATE(B5,\"-\",C5)","v":"A03004-LANGE"},"A03004","LANGE"]
["A03014-HAMMEL-BOONIES","A03014","HAMMEL-BOONIES"]
["A03038-RIEHM","A03038","RIEHM"]
["A03040-DEE","A03040","DEE"]
["A03046-MOHS","A03046","MOHS"]
["A03048-POSTVILLE","A03048","POSTVILLE"]
["A03050-GREEN","A03050","GREEN"]
["A03066-ELSBERN","A03066","ELSBERN"]
["A03502-HARPERS FERRY","A03502","HARPERS FERRY","3iB"]
["A04016-WALNUT CITY","A04016","WALNUT CITY"]
["A05506-EXIRA","A05506","EXIRA"]
["A06006-GARRISON B","A06006","GARRISON B"]
["A06012-JABENS","A06012","JABENS"]
["A07004-WATERLOO SOUTH","A07004","WATERLOO SOUTH"]
["A07008-MORGAN","A07008","MORGAN"]
["A07018-RAYMOND-PESKE","A07018","RAYMOND-PESKE"]
["A07020-STEINBRON","A07020","STEINBRON"]
["A07508-GILBERTVILLE","A07508","GILBERTVILLE"]
["A09006-TRIPOLI-PLATTE","A09006","TRIPOLI-PLATTE","3iB"]
["A10002-WESTON-LAMONT","A10002","WESTON-LAMONT","3iB"]
["A10004-BLOOM-JESUP","A10004","BLOOM-JESUP"]
["A10008-OELWEIN","A10008","OELWEIN"]
["A10010-HAZELTON","A10010","HAZELTON","3iB"]
["A10016-OELWEIN #2","A10016","OELWEIN #2"]
["A10022-BROOKS","A10022","BROOKS"]
["A10030-SOUTH AURORA","A10030","SOUTH AURORA","3iB"]
["A12502-CLARKSVILLE","A12502","CLARKSVILLE"]
["A14504-REINHART","A14504","REINHART"]
["A14510-LANESBORO","A14510","LANESBORO"]
["A14514-MACKE","A14514","MACKE"]
["A14518-MILLER","A14518","MILLER"]
["A16004-LOWDEN-SCHNECKLOTH","A16004","LOWDEN-SCHNECKLOTH"]
["A16006-STONEMILL","A16006","STONEMILL","3iB"]
["A16012-ONION GROVE","A16012","ONION GROVE"]
["A16022-TRICON","A16022","TRICON"]
["A17008-PORTLAND WEST","A17008","PORTLAND WEST"]
["A17012-UBBEN","A17012","UBBEN","3iB"]
["A17020-MASON CITY","A17020","MASON CITY"]
["A17514-HOLCIM SAND","A17514","HOLCIM SAND"]
["A18506-CHEROKEE SOUTH","A18506","CHEROKEE SOUTH"]
["A18514-LARRABEE-MONTGOMERY","A18514","LARRABEE-MONTGOMERY"]
["A18526-CHEROKEE NORTH","A18526","CHEROKEE NORTH"]
["A18528-WASHTA","A18528","WASHTA"]
["A18534-NELSON","A18534","NELSON"]
["A19522-BUCKY'S","A19522","BUCKY'S","3iB"]
["A21506-EVERLY","A21506","EVERLY"]
["A21516-SPENCER #1","A21516","SPENCER #1"]
["A22004-BENTE-ELKADER-WATSON","A22004","BENTE-ELKADER-WATSON"]
["A22010-OSTERDOCK","A22010","OSTERDOCK"]
["A22012-SCHMIDT","A22012","SCHMIDT"]
["A22014-BLUME","A22014","BLUME"]
["A22016-GISLESON","A22016","GISLESON"]
["A22020-MUELLER","A22020","MUELLER"]
["A22030-EBERHARDT","A22030","EBERHARDT"]
["A22034-KRUSE","A22034","KRUSE","3iB"]
["A22038-FASSBINDER","A22038","FASSBINDER"]
["A22040-HARTMAN","A22040","HARTMAN"]
["A22060-JOHNSON","A22060","JOHNSON"]
["A22062-SNY MAGILL","A22062","SNY MAGILL"]
["A22068-MILLVILLE","A22068","MILLVILLE"]
["A22070-BERNHARD/GIARD","A22070","BERNHARD/GIARD"]
["A22074-STRAWBERRY POINT","A22074","STRAWBERRY POINT"]
["A22084-MOYNA","A22084","MOYNA"]
["A22090-FRENCHTOWN","A22090","FRENCHTOWN","3iB"]
[{"$f":"CONCATENATE(B69,\"-\",C69)","v":"A23002-ELWOOD-YEAGER"},"A23002","ELWOOD-YEAGER"]
["A23004-BEHR","A23004","BEHR"]
["A23006-SHAFFTON","A23006","SHAFFTON"]
["A23504-BEHR","A23504","BEHR"]
["A24512-DUNLAP","A24512","DUNLAP"]
["A25510-PERRY","A25510","PERRY"]
["A25514-BOONEVILLE","A25514","BOONEVILLE"]
["A25516-VAN METER SOUTH","A25516","VAN METER SOUTH"]
["A25518-RACCOON RIVER SAND","A25518","RACCOON RIVER SAND"]
["A25520-LEAGACY MATERIALS","A25520","LEAGACY MATERIALS"]
["A25522-BOONEVILLE WEST","A25522","BOONEVILLE WEST"]
["A26004-LEWIS","A26004","LEWIS"]
["A26006-BROWN","A26006","BROWN"]
["A28008-EDGEWOOD WEST","A28008","EDGEWOOD WEST"]
["A28010-TIBBOTT","A28010","TIBBOTT"]
["A28012-BAUL","A28012","BAUL"]
["A28014-LOGAN","A28014","LOGAN"]
["A28016-WHITE","A28016","WHITE"]
["A28038-EDGEWOOD EAST","A28038","EDGEWOOD EAST"]
["A28040-KRAPFL","A28040","KRAPFL","3iB"]
["A28044-DUNDEE","A28044","DUNDEE"]
["A28052-MANCHESTER","A28052","MANCHESTER"]
["A29002-MEDIAPOLIS","A29002","MEDIAPOLIS"]
["A29008-NELSON","A29008","NELSON"]
["A29502-SPRING GROVE","A29502","SPRING GROVE"]
["A30508-FOSTORIA/LOST","A30508","FOSTORIA/LOST"]
["A30510-WEDEKING","A30510","WEDEKING"]
["A30520-MILFORD/DERNER","A30520","MILFORD/DERNER"]
["A31002-ROSE SPUR","A31002","ROSE SPUR"]
["A31006-DYERSVILLE EAST","A31006","DYERSVILLE EAST"]
["A31008-KLEIN-RICHARDSVILLE","A31008","KLEIN-RICHARDSVILLE"]
["A31010-BROWN","A31010","BROWN"]
["A31014-KURT","A31014","KURT","3iB"]
["A31018-MELOY","A31018","MELOY"]
["A31020-SCHLITCHE","A31020","SCHLITCHE"]
["A31026-ARNSDORF","A31026","ARNSDORF"]
["A31028-THOLE","A31028","THOLE"]
["A31032-CASCADE-REITER","A31032","CASCADE-REITER"]
["A31046-DECKER","A31046","DECKER"]
["A31048-MCDERMOTT","A31048","MCDERMOTT"]
["A31050-PLOESSEL-DYERSVILLE","A31050","PLOESSEL-DYERSVILLE"]
["A31052-EPWORTH-KIDDER","A31052","EPWORTH-KIDDER"]
["A31056-RUBIE","A31056","RUBIE","3iB"]
["A31060-CASCADE EAST","A31060","CASCADE EAST","3iB"]
["A31066-FILLMORE","A31066","FILLMORE"]
["A31068-DYERSVILLE-MAIERS","A31068","DYERSVILLE-MAIERS"]
["A32502-ESTHERVILLE","A32502","ESTHERVILLE"]
["A32530-ESTHERVILLE/WHITE","A32530","ESTHERVILLE/WHITE"]
["A32538-JENSEN","A32538","JENSEN"]
["A32548-LILLAND","A32548","LILLAND"]
["A33002-ELDORADO-JACOBSEN","A33002","ELDORADO-JACOBSEN","3iB"]
["A33024-WAUCOMA","A33024","WAUCOMA","3iB"]
["A33038-PAPE","A33038","PAPE","3iB"]
["A34002-CARVILLE-BUNN","A34002","CARVILLE-BUNN"]
["A34004-MAXON","A34004","MAXON"]
["A34008-WARNHOLTZ","A34008","WARNHOLTZ"]
["A34010-LACOSTE","A34010","LACOSTE","3iB"]
["A34018-JONES","A34018","JONES","3iB"]
["A34502-ROCKFORD","A34502","ROCKFORD"]
["A34516-CEDAR ACRE RESORT","A34516","CEDAR ACRE RESORT"]
["A34520-FOOTHILL","A34520","FOOTHILL"]
["A35502-GENEVA","A35502","GENEVA"]
["A35522-MCDOWELL SAND","A35522","MCDOWELL SAND"]
["A37504-JEFFERSON","A37504","JEFFERSON"]
[{"$f":"CONCATENATE(B133,\"-\",C133)","v":"A37520-GREEN COUNTY MATERIALS"},"A37520","GREEN COUNTY MATERIALS"]
["A40006-GRANDGEORGE","A40006","GRANDGEORGE","3iB"]
["A41002-GARNER NORTH","A41002","GARNER NORTH","3iB"]
["A42002-ALDEN","A42002","ALDEN","3iB"]
["A42532-H & M FARMS","A42532","H & M FARMS"]
["A43512-WOODBINE-MCCANN","A43512","WOODBINE-MCCANN"]
["A44006-LEEPER","A44006","LEEPER"]
["A45006-NELSON","A45006","NELSON"]
["A45008-DOTZLER","A45008","DOTZLER"]
["A45010-DALEY","A45010","DALEY"]
["A45028-ELMA","A45028","ELMA"]
["A45504-ECKERMAN","A45504","ECKERMAN"]
["A45508-SOVEREIGN","A45508","SOVEREIGN"]
["A46004-GRIFFITH","A46004","GRIFFITH","3iB"]
["A46006-HODGES","A46006","HODGES"]
["A46014-PEDERSEN","A46014","PEDERSEN"]
["A46018-MOORE EAST","A46018","MOORE EAST","3iB"]
["A46518-PEDERSEN","A46518","PEDERSEN"]
["A49002-BELLEVUE","A49002","BELLEVUE"]
["A49008-IRON HILL","A49008","IRON HILL"]
["A49010-ANDREW","A49010","ANDREW","3iB"]
["A49012-FROST","A49012","FROST","3iB"]
["A49020-PRESTON","A49020","PRESTON"]
["A49021-PRESTON R/M","A49021","PRESTON R/M"]
["A49024-MAQUOKETA EAST","A49024","MAQUOKETA EAST"]
["A49060-ST DONATUS","A49060","ST DONATUS"]
["A49064-VEACH","A49064","VEACH"]
["A49068-BELLEVUE FARM","A49068","BELLEVUE FARM"]
["A49506-BELLEVUE","A49506","BELLEVUE","3iB"]
["A49516-TURNER","A49516","TURNER","3iB"]
["A49524-GRIEBEL","A49524","GRIEBEL","3iB"]
["A49526-BELLEVUE FARM","A49526","BELLEVUE FARM","3iB"]
["A49530-PETERSON","A49530","PETERSON","3iB"]
["A50002-SULLY MINE","A50002","SULLY MINE"]
["A51006-FAIRFIELD","A51006","FAIRFIELD"]
["A52004-CONKLIN","A52004","CONKLIN","3iB"]
["A52006-KLEIN","A52006","KLEIN","3iB"]
["A52008-ERNST","A52008","ERNST"]
["A53002-FARMERS-BEHRENDS","A53002","FARMERS-BEHRENDS"]
["A53006-ANAMOSA","A53006","ANAMOSA"]
["A53010-BALLOU-OLIN","A53010","BALLOU-OLIN","3iB"]
["A53016-STONE CITY","A53016","STONE CITY"]
["A53018-FINN","A53018","FINN"]
["A53024-SULLIVAN","A53024","SULLIVAN"]
["A53026-ANAMOSA","A53026","ANAMOSA"]
["A54002-KESWICK","A54002","KESWICK"]
["A54004-OLLIE","A54004","OLLIE"]
["A54010-LYLE MINE","A54010","LYLE MINE"]
["A56016-HERITAGE","A56016","HERITAGE"]
["A57002-BETENBENDER-COGGON","A57002","BETENBENDER-COGGON"]
["A57006-ROBINS","A57006","ROBINS"]
["A57008-BOWSER-SPRINGVILLE","A57008","BOWSER-SPRINGVILLE"]
["A57018-CEDAR RAPIDS","A57018","CEDAR RAPIDS"]
["A57022-LEE CRAWFORD","A57022","LEE CRAWFORD"]
["A57028-CEDAR RAPIDS SOUTH","A57028","CEDAR RAPIDS SOUTH"]
["A57528-BLAIRSFERRY SAND","A57528","BLAIRSFERRY SAND"]
["A58002-COLUMBUS JCT.","A58002","COLUMBUS JCT."]
["A60502-ROCK RAPIDS #1","A60502","ROCK RAPIDS #1"]
["A63002-DURHAM MINE","A63002","DURHAM MINE"]
["A63010-KNOXVILLE QUARRY","A63010","KNOXVILLE QUARRY"]
["A63512-NEW HARVEY","A63512","NEW HARVEY"]
["A64002-FERGUSON","A64002","FERGUSON"]
["A64004-LE GRAND","A64004","LE GRAND"]
["A66002-DUENOW","A66002","DUENOW","3iB"]
[{"$f":"CONCATENATE(B197,\"-\",C197)","v":"A66016-LESCH"},"A66016","LESCH"]
["A66516-BOERJAN","A66516","BOERJAN"]
["A67502-RODNEY","A67502","RODNEY"]
["A70002-MOSCOW","A70002","MOSCOW","3iB"]
["A70506-ACME","A70506","ACME"]
["A72504-OCHEYEDAN","A72504","OCHEYEDAN"]
["A72506-ASHTON","A72506","ASHTON"]
["A72530-BOYD","A72530","BOYD"]
["A72534-ASHTON-SEIVERT","A72534","ASHTON-SEIVERT"]
["A73538-MONEY PIT #1","A73538","MONEY PIT #1"]
["A73508-SHENANDOAH-CONNELL II","A73508","SHENANDOAH-CONNELL II"]
["A74502-EMMETSBURG S&G","A74502","EMMETSBURG S&G"]
["A75502-AKRON","A75502","AKRON"]
["A75503-AKRON","A75503","AKRON"]
["A76004-MOORE","A76004","MOORE","3iB"]
["A77504-DENNY-JOHNSTON","A77504","DENNY-JOHNSTON"]
["A77522-EDM #2-VANDALIA","A77522","EDM #2-VANDALIA"]
["A77530-NORTH DES MOINES WHITE","A77530","NORTH DES MOINES WHITE"]
["A77534-SAYLORVILLE SAND","A77534","SAYLORVILLE SAND"]
["A77538-NORTH DES MOINES HOVELAND","A77538","NORTH DES MOINES HOVELAND"]
["A78504-OAKLAND","A78504","OAKLAND"]
["A79002-MALCOM MINE","A79002","MALCOM MINE"]
["A81502-SACTON-LAKEVIEW","A81502","SACTON-LAKEVIEW"]
["A81504-AUBURN","A81504","AUBURN"]
["A81514-CARNARVON S&G","A81514","CARNARVON S&G"]
["A81528-WALL LAKE","A81528","WALL LAKE"]
["A81542-WALL LAKE BOYER","A81542","WALL LAKE BOYER"]
["A81544-ULMER-MEISTER","A81544","ULMER-MEISTER"]
["A81546-MEISTER","A81546","MEISTER"]
["A82002-MCCAUSLAND(MC39)","A82002","MCCAUSLAND(MC39)"]
["A82004-NEW LIBERTY(MC41)","A82004","NEW LIBERTY(MC41)","3iB"]
["A82006-LECLAIRE(MC38)","A82006","LECLAIRE(MC38)"]
["A82008-LINWOOD MINE","A82008","LINWOOD MINE","3iB"]
["A83506-HARLAN-REINIG","A83506","HARLAN-REINIG"]
["A84502-VANZEE","A84502","VANZEE"]
["A84506-HUDSON-OSTERCAMP","A84506","HUDSON-OSTERCAMP"]
["A84510-HAWARDEN-NORTH","A84510","HAWARDEN-NORTH"]
["A84528-HIGMAN-CHATSWORTH","A84528","HIGMAN-CHATSWORTH"]
["A84536-VANBEEK","A84536","VANBEEK"]
["A84538-VAN'T HUL","A84538","VAN'T HUL"]
["A85006-AMES MINE","A85006","AMES MINE","3iB"]
["A85510-AMES SOUTH","A85510","AMES SOUTH"]
["A86002-MONTOUR","A86002","MONTOUR"]
["A86502-FLINT","A86502","FLINT"]
["A89002-DOUDS MINE","A89002","DOUDS MINE"]
["A89006-FARMINGTON-COMANCHE","A89006","FARMINGTON-COMANCHE"]
["A89008-SELMA-GARDNER","A89008","SELMA-GARDNER"]
["A90508-STEVENSON","A90508","STEVENSON"]
["A90510-CHILLICOTHE","A90510","CHILLICOTHE"]
["A92002-WEST CHESTER","A92002","WEST CHESTER"]
["A94002-FT DODGE MINE","A94002","FT DODGE MINE","3iB"]
["A96002-KENDALLVILLE","A96002","KENDALLVILLE","3iB"]
["A96004-HOVEY","A96004","HOVEY","3iB"]
["A96011-GJETLEY","A96011","GJETLEY","3iB"]
["A96017-SKYLINE B","A96017","SKYLINE B","3iB"]
["A96052-ESTREM","A96052","ESTREM"]
["A96064-STIKA","A96064","STIKA"]
["A96090-MCKENNA SOUTH","A96090","MCKENNA SOUTH","3iB"]
["A97502-CORRECTIONVILLE-BUCK","A97502","CORRECTIONVILLE-BUCK"]
["A97516-ANTHON","A97516","ANTHON"]
["A97518-SMITHLAND","A97518","SMITHLAND"]
["A97538-ANTHON-WRIGHT","A97538","ANTHON-WRIGHT"]
["A98010-FERTILE","A98010","FERTILE"]
["A98014-STEVENS","A98014","STEVENS"]
[{"$f":"CONCATENATE(B261,\"-\",C261)","v":"A98016-EMIL OLSON-BOLTON"},"A98016","EMIL OLSON-BOLTON"]
["A98020-TRENHAILE","A98020","TRENHAILE"]
["A98502-RANDALL TRANSIT MIX","A98502","RANDALL TRANSIT MIX"]
["A98504-FERTILE","A98504","FERTILE","3iB"]
["A99002-VOSS","A99002","VOSS"]
["A99502-WRIGHT","A99502","WRIGHT"]
["AIL006-MIDWAY(MC45)","AIL006","MIDWAY(MC45)","3iB"]
["AIL010-ALLIED(MC30)","AIL010","ALLIED(MC30)"]
["AIL014-DALLAS CITY","AIL014","DALLAS CITY"]
["AIL016-CLEVELAND(MC31)","AIL016","CLEVELAND(MC31)"]
["AIL020-HAMILTON","AIL020","HAMILTON"]
["AIL028-TURNBAUGH","AIL028","TURNBAUGH"]
["AIL046-BLUFF CITY MATERIALS","AIL046","BLUFF CITY MATERIALS"]
["AIL522-CORDOVA INLAND","AIL522","CORDOVA INLAND","3iB"]
["AMN004-POOL HILL","AMN004","POOL HILL"]
["AMN006-OTTERNESS","AMN006","OTTERNESS"]
["AMN008-QUARTZITE","AMN008","QUARTZITE"]
["AMN010-ST CLOUD-GRANITE","AMN010","ST CLOUD-GRANITE"]
["AMN024-YELLOW MEDICINE","AMN024","YELLOW MEDICINE"]
["AMN026-BIG STONE","AMN026","BIG STONE"]
["AMN030-GENGLER","AMN030","GENGLER","3iB"]
["AMN032-COTTONWOOD","AMN032","COTTONWOOD"]
["AMN034-ENGRAV","AMN034","ENGRAV"]
["AMN042-SCOTT","AMN042","SCOTT"]
["AMN044-BIESANZ","AMN044","BIESANZ"]
["AMN046-43 QUARRY","AMN046","43 QUARRY"]
[{"$f":"CONCATENATE(B287,\"-\",C287)","v":"AMN052-ABNET"},"AMN052","ABNET"]
[{"$f":"CONCATENATE(B288,\"-\",C288)","v":"AMN054-HARDROCK"},"AMN054","HARDROCK"]
["AMN528-POPE","AMN528","POPE"]
["AMN536-ELK RIVER","AMN536","ELK RIVER"]
[{"$f":"CONCATENATE(B291,\"-\",C291)","v":"AMN550-SACHS"},"AMN550","SACHS"]
["AMN558-ST CROIX","AMN558","ST CROIX"]
["AMN566-ELK RIVER","AMN566","ELK RIVER"]
["AMN568-EMPIRE","AMN568","EMPIRE"]
["AMN570-WINONA AGGREGATE","AMN570","WINONA AGGREGATE"]
["AMN576-TILSTRA","AMN576","TILSTRA"]
["AMO002-KAHOKA","AMO002","KAHOKA"]
["AMO022-IRON MT","AMO022","IRON MT"]
["AMO024-HUNTINGTON","AMO024","HUNTINGTON"]
["AMO058-PIT#3","AMO058","PIT#3"]
["AMO060-RANDOLPH MINE","AMO060","RANDOLPH MINE"]
["ANE002-WEEPING WATER MINE","ANE002","WEEPING WATER MINE","3iB"]
["ANE010-FT CALHOUN","ANE010","FT CALHOUN","3iB"]
["ANE504-WATERLOO #40","ANE504","WATERLOO #40"]
["ANE544-VALLEY","ANE544","VALLEY"]
["ANE548-WEST CENTER SAND","ANE548","WEST CENTER SAND"]
["ANE552 -WATERLOO SAND","ANE552 ","WATERLOO SAND"]
["ANE560-PLANT #47","ANE560","PLANT #47"]
["ANE564-NORTH VALLEY SAND","ANE564","NORTH VALLEY SAND"]
["ANE566-PLANT #52","ANE566","PLANT #52"]
["ASD002-DELL RAPIDS","ASD002","DELL RAPIDS","3iB"]
["ASD004-SIOUX FALLS QUARTZITE","ASD004","SIOUX FALLS QUARTZITE","3iB"]
["ASD006-EAST SIOUX","ASD006","EAST SIOUX"]
["ASD008-SPENCER","ASD008","SPENCER","3iB"]
[{"$f":"CONCATENATE(B315,\"-\",C315)","v":"ASD526-CORSON"},"ASD526","CORSON"]
["AWI022-KINGS BLUFF","AWI022","KINGS BLUFF"]
["AWI030-HAVERLAND","AWI030","HAVERLAND"]
["AWI038-ATHENS","AWI038","ATHENS"]
["AWI044-SLAMA","AWI044","SLAMA"]
["AWI046-HAHN","AWI046","HAHN"]
["AWI502-PRAIRIE DU CHIEN","AWI502","PRAIRIE DU CHIEN"]
["AWI504-VOGT","AWI504","VOGT"]
["AWI514-HAGER CITY","AWI514","HAGER CITY"]
["AWI524-HAEF","AWI524","HAEF"]
[{"$f":"CONCATENATE(B325,\"-\",C325)","v":"AWI528-NELSON"},"AWI528","NELSON"]

{"sheet":"FA","index":20,"n_rows":284,"n_cols":3,"rows_kept":284,"cut":false,"hidden":true,"merged":[[0,0,1,3]]}
["Fine Aggregate Source Information"]
[]
[]
[{"$f":"CONCATENATE(B4,\"-\",C4)","v":"A03502-HARPERS FERRY"},"A03502","HARPERS FERRY"]
["A03520-IVERSON 2","A03520","IVERSON 2"]
["A05506-EXIRA","A05506","EXIRA"]
["A06502-VINTON-MILROY","A06502","VINTON-MILROY"]
["A06504-COOTS SAND/VINTON","A06504","COOTS SAND/VINTON"]
["A06506-PORK CHOP","A06506","PORK CHOP"]
["A07504-WATERLOO SAND","A07504","WATERLOO SAND"]
["A07506-ASPRO","A07506","ASPRO"]
["A07508-GILBERTVILLE","A07508","GILBERTVILLE"]
["A07512-ZEIEN S&G","A07512","ZEIEN S&G"]
["A07518-JANESVILLE","A07518","JANESVILLE"]
["A07520-BENTON'S LAKE","A07520","BENTON'S LAKE"]
["A09510-PLAINFIELD/ADAMS","A09510","PLAINFIELD/ADAMS"]
["A09512-BOEVERS","A09512","BOEVERS"]
["A10516-MILLER","A10516","MILLER"]
["A10518-YEAROUS","A10518","YEAROUS"]
["A10520-BROOKS","A10520","BROOKS"]
["A10522-NIEMANN-DECKER","A10522","NIEMANN-DECKER"]
["A10524-CRAWFORD","A10524","CRAWFORD"]
["A12502-CLARKSVILLE","A12502","CLARKSVILLE"]
["A12518-SHELL ROCK-ADAMS","A12518","SHELL ROCK-ADAMS"]
["A12520-PARKERSBURG","A12520","PARKERSBURG"]
["A12522-HOBSON","A12522","HOBSON"]
["A13504-JENSEN","A13504","JENSEN"]
["A13506-MOHR","A13506","MOHR"]
["A14504-REINHART","A14504","REINHART"]
["A14510-LANESBORO","A14510","LANESBORO"]
["A14514-MACKE","A14514","MACKE"]
["A14518-MILLER","A14518","MILLER"]
["A16502-SHARPLISS","A16502","SHARPLISS"]
["A16506-ONION GROVE","A16506","ONION GROVE"]
["A16510-CEDAR BLUFF","A16510","CEDAR BLUFF"]
["A17514-HOLCIM SAND","A17514","HOLCIM SAND"]
["A17520-TUTTLE","A17520","TUTTLE"]
["A17522-GRAF PIT","A17522","GRAF PIT"]
["A18506-CHEROKEE SOUTH","A18506","CHEROKEE SOUTH"]
["A18514-LARRABEE-MONTGOMERY","A18514","LARRABEE-MONTGOMERY"]
["A18526-CHEROKEE NORTH","A18526","CHEROKEE NORTH"]
["A18528-WASHTA","A18528","WASHTA"]
["A18534-NELSON","A18534","NELSON"]
["A19508-BUSTA","A19508","BUSTA"]
["A19512-PEARL ROCK","A19512","PEARL ROCK"]
["A19514-NASHUA","A19514","NASHUA"]
["A19516-REWOLDT","A19516","REWOLDT"]
["A19522-BUCKY'S","A19522","BUCKY'S"]
["A21506-EVERLY","A21506","EVERLY"]
["A21516-SPENCER #1","A21516","SPENCER #1"]
["A21538-NORGAARD SAND & GRAVEL","A21538","NORGAARD SAND & GRAVEL"]
["A22510-BENTE","A22510","BENTE"]
["A22520-WELTERLEN","A22520","WELTERLEN"]
["A22522-MOYNA","A22522","MOYNA"]
["A23504-BEHR","A23504","BEHR"]
["A23506-SCHNECKLOTH","A23506","SCHNECKLOTH"]
["A23514-ANDERSON","A23514","ANDERSON"]
["A23516-OLSON","A23516","OLSON"]
["A24512-DUNLAP","A24512","DUNLAP"]
["A25510-PERRY","A25510","PERRY"]
["A25514-BOONEVILLE","A25514","BOONEVILLE"]
["A25516-VAN METER SOUTH","A25516","VAN METER SOUTH"]
["A25518-RACCOON RIVER SAND","A25518","RACCOON RIVER SAND"]
["A25520-LEGACY MATERIALS","A25520","LEGACY MATERIALS"]
["A25522-BOONEVILLE WEST","A25522","BOONEVILLE WEST"]
["A26502-ELDON-FRANKLIN","A26502","ELDON-FRANKLIN"]
["A28504-TEGLER","A28504","TEGLER"]
[{"$f":"CONCATENATE(B68,\"-\",C68)","v":"A28510-LOGAN"},"A28510","LOGAN"]
["A28520-MANCHESTER","A28520","MANCHESTER"]
["A28526-HAWK","A28526","HAWK"]
["A28528-CAR 6","A28528","CAR 6"]
["A28530-SUMMERS PIT","A28530","SUMMERS PIT"]
["A29502-SPRING GROVE","A29502","SPRING GROVE"]
["A30508-FOSTORIA/LOST","A30508","FOSTORIA/LOST"]
["A30510-WEDEKING","A30510","WEDEKING"]
["A30520-MILFORD/DERNER","A30520","MILFORD/DERNER"]
["A30526-MILL CREEK","A30526","MILL CREEK"]
["A31512-BURKLE","A31512","BURKLE"]
["A31514-FILLMORE","A31514","FILLMORE"]
["A31516-CASCADE-LOCHER","A31516","CASCADE-LOCHER"]
["A31518-MAIERS","A31518","MAIERS"]
["A32502-ESTHERVILLE","A32502","ESTHERVILLE"]
["A32530-ESTHERVILLE/WHITE","A32530","ESTHERVILLE/WHITE"]
["A32538-JENSEN","A32538","JENSEN"]
["A32544-ANDERSON","A32544","ANDERSON"]
["A32548-LILLAND","A32548","LILLAND"]
["A33506-ALPHA","A33506","ALPHA"]
["A33510-RANDALIA","A33510","RANDALIA"]
["A33518-BASSETT","A33518","BASSETT"]
["A33520-OELWEIN SAND","A33520","OELWEIN SAND"]
["A33522-PAPE","A33522","PAPE"]
["A33524-ROGERS","A33524","ROGERS"]
["A33528-KASEMEIER","A33528","KASEMEIER"]
["A34502-ROCKFORD","A34502","ROCKFORD"]
["A34516-CEDAR ACRE RESORT","A34516","CEDAR ACRE RESORT"]
["A34520-FOOTHILL","A34520","FOOTHILL"]
["A34522-ROTTINGHAUS","A34522","ROTTINGHAUS"]
["A35502-GENEVA","A35502","GENEVA"]
["A35520-BRANDT","A35520","BRANDT"]
["A35522-MCDOWELL SAND","A35522","MCDOWELL SAND"]
["A37504-JEFFERSON","A37504","JEFFERSON"]
["A37514-WRIGHT","A37514","WRIGHT"]
["A37520-GREEN COUNTY MATERIALS","A37520","GREEN COUNTY MATERIALS"]
["A38504-HERONIMOUS","A38504","HERONIMOUS"]
["A38506-MEESTER","A38506","MEESTER"]
["A39508-L & L","A39508","L & L"]
["A40512-ANDERSON","A40512","ANDERSON"]
["A42512-HARDIN AGGREGATES","A42512","HARDIN AGGREGATES"]
["A42532-H & M FARMS","A42532","H & M FARMS"]
["A43512-WOODBINE-MCCANN","A43512","WOODBINE-MCCANN"]
["A44502-NORTH ROME","A44502","NORTH ROME"]
["A44504-ENSMINGER-ROME","A44504","ENSMINGER-ROME"]
["A44506-COPPOCK SAND","A44506","COPPOCK SAND"]
["A45504-ECKERMAN","A45504","ECKERMAN"]
["A45508-SOVEREIGN","A45508","SOVEREIGN"]
["A45516-FREIDERICH","A45516","FREIDERICH"]
["A45518-ELMA","A45518","ELMA"]
["A45520-HOOVER","A45520","HOOVER"]
["A45522-LE ROY","A45522","LE ROY"]
["A46516-ERICKSON","A46516","ERICKSON"]
["A46518-PEDERSEN","A46518","PEDERSEN"]
["A48506-MARENGO","A48506","MARENGO"]
["A48508-DISTERHOFT","A48508","DISTERHOFT"]
["A49506-BELLEVUE","A49506","BELLEVUE"]
["A49516-TURNER","A49516","TURNER"]
["A49524-GRIEBEL","A49524","GRIEBEL"]
["A49526-BELLEVUE FARM","A49526","BELLEVUE FARM"]
["A49530-PETERSON","A49530","PETERSON"]
["A49538-MAQUOKETA SAND","A49538","MAQUOKETA SAND"]
["A50504-REASNOR","A50504","REASNOR"]
["A52508-WILLIAMS","A52508","WILLIAMS"]
[{"$f":"CONCATENATE(B132,\"-\",C132)","v":"A52510-RIVERSIDE #2"},"A52510","RIVERSIDE #2"]
["A52512-RIVERSIDE SAND","A52512","RIVERSIDE SAND"]
["A53514-FLEMING","A53514","FLEMING"]
["A53522-WEBER","A53522","WEBER"]
["A53526-STEPHENS","A53526","STEPHENS"]
["A53528-ANAMOSA","A53528","ANAMOSA"]
["A53530-ANAMOSA-WOOD'S","A53530","ANAMOSA-WOOD'S"]
["A53532-LOES","A53532","LOES"]
["A56504-VINCENNES","A56504","VINCENNES"]
["A56506-FT MADISON","A56506","FT MADISON"]
["A56508-LEE COUNTY S & G","A56508","LEE COUNTY S & G"]
["A57520-IVANHOE","A57520","IVANHOE"]
["A57528-BLAIRSFERRY SAND","A57528","BLAIRSFERRY SAND"]
["A57530-HESS","A57530","HESS"]
["A57534-LINN COUNTY SAND","A57534","LINN COUNTY SAND"]
["A57536-POWER PLANT","A57536","POWER PLANT"]
["A58504-FREDONIA","A58504","FREDONIA"]
["A60502-ROCK RAPIDS #1","A60502","ROCK RAPIDS #1"]
["A62502-G71","A62502","G71"]
["A63502-BEAN PROPERTY","A63502","BEAN PROPERTY"]
["A63512-NEW HARVEY","A63512","NEW HARVEY"]
["A64508-NEW MARSHALLTOWN","A64508","NEW MARSHALLTOWN"]
["A66502-OSAGE-SCHMIDT","A66502","OSAGE-SCHMIDT"]
["A66512-KLAAHSEN","A66512","KLAAHSEN"]
["A66514-LOVIK","A66514","LOVIK"]
["A66516-BOERJAN","A66516","BOERJAN"]
["A66520-LESCH","A66520","LESCH"]
["A67502-RODNEY","A67502","RODNEY"]
["A70504-ATALISSA-MCKILLIP","A70504","ATALISSA-MCKILLIP"]
["A70506-ACME","A70506","ACME"]
["A71504-RABE PAULLINA","A71504","RABE PAULLINA"]
["A71536-PHLOW CREEK","A71536","PHLOW CREEK"]
["A72504-OCHEYEDAN","A72504","OCHEYEDAN"]
["A72506-ASHTON","A72506","ASHTON"]
["A72524-BOERHAVE","A72524","BOERHAVE"]
["A72530-BOYD","A72530","BOYD"]
["A72532-ENGEL","A72532","ENGEL"]
["A72534-ASHTON-SEIVERT","A72534","ASHTON-SEIVERT"]
["A72538-MONEY PIT #1","A72538","MONEY PIT #1"]
["A73508-SHENANDOAH-CONNELL II","A73508","SHENANDOAH-CONNELL II"]
["A74502-EMMETSBURG S&G","A74502","EMMETSBURG S&G"]
["A75502-AKRON","A75502","AKRON"]
["A75503-AKRON","A75503","AKRON"]
["A75524-G DIRKSEN #2","A75524","G DIRKSEN #2"]
["A75526-FRITZ DIRKSEN","A75526","FRITZ DIRKSEN"]
["A76514-MILLER","A76514","MILLER"]
["A76518-BANWART","A76518","BANWART"]
["A77504-DENNY-JOHNSTON","A77504","DENNY-JOHNSTON"]
["A77522-EDM #2-VANDALIA","A77522","EDM #2-VANDALIA"]
["A77530-NORTH DES MOINES WHITE","A77530","NORTH DES MOINES WHITE"]
["A77534-SAYLORVILLE SAND","A77534","SAYLORVILLE SAND"]
["A77538-NORTH DES MOINES HOVELAND","A77538","NORTH DES MOINES HOVELAND"]
["A77540-P-HILL EAST","A77540","P-HILL EAST"]
["A78504-OAKLAND","A78504","OAKLAND"]
["A81502-SACTON-LAKEVIEW","A81502","SACTON-LAKEVIEW"]
["A81504-AUBURN","A81504","AUBURN"]
["A81506-SAC CITY","A81506","SAC CITY"]
["A81514-CARNARVON S&G","A81514","CARNARVON S&G"]
["A81520-UREN","A81520","UREN"]
["A81528-WALL LAKE","A81528","WALL LAKE"]
["A81530-LEITZ NORTH","A81530","LEITZ NORTH"]
["A81534-EARLY","A81534","EARLY"]
["A81536-DAIKER","A81536","DAIKER"]
["A81542-WALL LAKE BOYER","A81542","WALL LAKE BOYER"]
[{"$f":"CONCATENATE(B196,\"-\",C196)","v":"A81544-ULMER-MEISTER"},"A81544","ULMER-MEISTER"]
["A81546-MEISTER","A81546","MEISTER"]
["A81550-HOSTEG-HAGGE","A81550","HOSTEG-HAGGE"]
["A83506-HARLAN-REINIG","A83506","HARLAN-REINIG"]
["A84502-VANZEE","A84502","VANZEE"]
["A84506-HUDSON-OSTERCAMP","A84506","HUDSON-OSTERCAMP"]
["A84510-HAWARDEN-NORTH","A84510","HAWARDEN-NORTH"]
["A84528-HIGMAN-CHATSWORTH","A84528","HIGMAN-CHATSWORTH"]
["A84532-LASSON","A84532","LASSON"]
["A84536-VANBEEK","A84536","VANBEEK"]
["A84538-VAN'T HUL","A84538","VAN'T HUL"]
["A85510-AMES SOUTH","A85510","AMES SOUTH"]
["A86502-FLINT","A86502","FLINT"]
["A90506-OTTUMWA SAND","A90506","OTTUMWA SAND"]
["A90508-STEVENSON","A90508","STEVENSON"]
["A90510-CHILLICOTHE","A90510","CHILLICOTHE"]
["A92502-RIVERSIDE","A92502","RIVERSIDE"]
["A94502-YATES","A94502","YATES"]
["A94522-CROFT","A94522","CROFT"]
["A94526-BUSKE","A94526","BUSKE"]
["A94532-REIGELSBERGER","A94532","REIGELSBERGER"]
["A96502-DECORAH","A96502","DECORAH"]
["A96506-FREEPORT","A96506","FREEPORT"]
["A96520-SWEDES BOTTOM","A96520","SWEDES BOTTOM"]
["A96526-STIKA","A96526","STIKA"]
["A96528-GJETLEY","A96528","GJETLEY"]
["A96530-CARLSON-FREEPORT","A96530","CARLSON-FREEPORT"]
["A96532-SCHMITT","A96532","SCHMITT"]
["A97502-CORRECTIONVILLE-BUCK","A97502","CORRECTIONVILLE-BUCK"]
["A97516-ANTHON","A97516","ANTHON"]
["A97518-SMITHLAND","A97518","SMITHLAND"]
["A97528-EDWARDS","A97528","EDWARDS"]
["A97532-CREASEY","A97532","CREASEY"]
["A97538-ANTHON-WRIGHT","A97538","ANTHON-WRIGHT"]
["A98502-RANDALL TRANSIT MIX","A98502","RANDALL TRANSIT MIX"]
["A98504-FERTILE","A98504","FERTILE"]
["A98524-TRENHAILE","A98524","TRENHAILE"]
["A99502-WRIGHT","A99502","WRIGHT"]
["A99510-MEINEKE","A99510","MEINEKE"]
["A99524-STECHER","A99524","STECHER"]
["AIL522-CORDOVA INLAND (MC17)","AIL522","CORDOVA INLAND (MC17)"]
["AIL526-BLUFF CITY SAND","AIL526","BLUFF CITY SAND"]
["AKS504-FRISBIE-PLANT #3","AKS504","FRISBIE-PLANT #3"]
["AKS506-OAKLAND SAND PIT","AKS506","OAKLAND SAND PIT"]
["AKS508-SILVER LAKE SAND PIT","AKS508","SILVER LAKE SAND PIT"]
["AMN516-OLSON","AMN516","OLSON"]
["AMN518-LANESBORO","AMN518","LANESBORO"]
["AMN522-PRAIRIE ISLAND #3","AMN522","PRAIRIE ISLAND #3"]
["AMN528-POPE","AMN528","POPE"]
["AMN536-ELK RIVER","AMN536","ELK RIVER"]
["AMN538-SHADE","AMN538","SHADE"]
["AMN544-LAKEVILLE","AMN544","LAKEVILLE"]
["AMN550-SACHS","AMN550","SACHS"]
["AMN552-WINDMILL","AMN552","WINDMILL"]
["AMN554-ANNENDALE","AMN554","ANNENDALE"]
["AMN558-ST CROIX","AMN558","ST CROIX"]
["AMN560-ROSEMOUNT","AMN560","ROSEMOUNT"]
["AMN562-LUVERNE","AMN562","LUVERNE"]
["AMN566-ELK RIVER","AMN566","ELK RIVER"]
["AMN568-EMPIRE","AMN568","EMPIRE"]
["AMN572-KUESTER #3","AMN572","KUESTER #3"]
["AMN574-LINDMAN SOUTH","AMN574","LINDMAN SOUTH"]
["AMN576-TILSTRA","AMN576","TILSTRA"]
["AMO502-WAYLAND","AMO502","WAYLAND"]
[{"$f":"CONCATENATE(B260,\"-\",C260)","v":"AMO516-MOUNT MORIAH"},"AMO516","MOUNT MORIAH"]
["AMO520-STANBERRY","AMO520","STANBERRY"]
["AMO524-CS61 LAGRANGE S&G","AMO524","CS61 LAGRANGE S&G"]
["ANE504-WATERLOO #40","ANE504","WATERLOO #40"]
["ANE538-WEST POINT","ANE538","WEST POINT"]
["ANE544-VALLEY","ANE544","VALLEY"]
["ANE548-WEST CENTER SAND","ANE548","WEST CENTER SAND"]
["ANE552-WATERLOO SAND-DOUGLAS CO","ANE552","WATERLOO SAND-DOUGLAS CO"]
["ANE560-PLANT #47","ANE560","PLANT #47"]
["ANE564-NORTH VALLEY SAND","ANE564","NORTH VALLEY SAND"]
["ANE566-PLANT #52","ANE566","PLANT #52"]
["ASD508-CANTON","ASD508","CANTON"]
["ASD522-BROOKINGS","ASD522","BROOKINGS"]
["ASD526-CORSON","ASD526","CORSON"]
["ASD528-EAST SIOUX","ASD528","EAST SIOUX"]
["AWI502-PRAIRIE DU CHIEN","AWI502","PRAIRIE DU CHIEN"]
["AWI504-VOGT","AWI504","VOGT"]
["AWI506-KRAMER","AWI506","KRAMER"]
["AWI508-BARN","AWI508","BARN"]
["AWI514-HAGER CITY","AWI514","HAGER CITY"]
["AWI516-SCHEER","AWI516","SCHEER"]
["AWI522-RIB FALLS PLANT","AWI522","RIB FALLS PLANT"]
["AWI524-HAEF","AWI524","HAEF"]
["AWI526-MILAS","AWI526","MILAS"]
["AWI528-NELSON","AWI528","NELSON"]

{"sheet":"CEMENT","index":21,"n_rows":51,"n_cols":11,"rows_kept":51,"cut":false,"hidden":true,"merged":[[0,0,1,4],[0,12,1,16]]}
["Cement"]
[]
[null,null,null,null,null,null,null,null,null,"HPC-S or D","HPC-O"]
[{"$f":"_xlfn.CONCAT(B4, \"-\", C4, \"-\",D4)","v":"PC0003-Ash Grove - Louisville-III"},"PC0003","Ash Grove - Louisville","III",3.15," ","I",0,1,"Minimum 30% Slag Required, 35% Maximum","Cement Type I Can't Be Used With This Mix."]
["PC0008-Ash Grove - Louisville-IP(25)","PC0008","Ash Grove - Louisville","IP(25)",2.99,"IP, IS, IT","I/II",0,1,"Minimum 30% Slag Required, 35% Maximum","Minimum 25% Slag Required, 35% Maximum"]
["PC0009-Ash Grove - Louisville-IL","PC0009","Ash Grove - Louisville","IL",3.11,"I, II, IL","III",0,1,"Cement Type III Can't Be Used With This Mix.","Cement Type III Can't Be Used With This Mix."]
["PC0018-Ash Grove - Louisville-IP(30)","PC0018","Ash Grove - Louisville","IP(30)",2.9,"IP, IS, IT","IL",0.1,0.9,"Minimum 30% Slag Required, 35% Maximum","Minimum 25% Slag Required, 35% Maximum"]
["PC0103-Ash Grove - Chanute-III","PC0103","Ash Grove - Chanute","III",3.15,null,"IP(25)",0.25,0.75]
["PC0108-Ash Grove - Chanute-IP(25)","PC0108","Ash Grove - Chanute","IP(25)",2.97,"IP, IS, IT","IP(30)",0.3,0.7]
["PC0109-Ash Grove - Chanute-IL","PC0109","Ash Grove - Chanute","IL",3.11,"I, II, IL","IS(20)",0.2,0.8," "," "]
["PC0203-Continental - Hannibal-III","PC0203","Continental - Hannibal","III",3.15,null,"IT(S20)(L9)",0.28999999999999998,0.71," "," "]
["PC0209-Continental - Hannibal-IL","PC0209","Continental - Hannibal","IL",3.11,"I, II, IL","IT(S25)(L9)",0.34,0.66," "," "]
["PC0403-Lehigh - Mason City-III","PC0403","Lehigh - Mason City","III",3.15,null,"IT(S30)(P10)",0.4,0.6," "," "]
["PC0409-Lehigh - Mason City-IL","PC0409","Lehigh - Mason City","IL",3.11,"I, II, IL","IT(S38)(L7)",0.45,0.55000000000000004," "," "]
["PC0509-Continental - Davenport-IL","PC0509","Continental - Davenport","IL",3.11,"I, II, IL","IT(P25)(L6)",0.31,0.69]
["PC0703-Central Plains - Sugar Creek-III","PC0703","Central Plains - Sugar Creek","III",3.15]
["PC0706-Central Plains - Sugar Creek-IT(S20)(L9)","PC0706","Central Plains - Sugar Creek","IT(S20)(L9)",3.07,"IP, IS, IT"]
["PC0709-Central Plains - Sugar Creek-IL","PC0709","Central Plains - Sugar Creek","IL",3.11,"I, II, IL"]
["PC0802-Monarch - Humboldt-I/II","PC0802","Monarch - Humboldt","I/II",3.14,"I, II, IL"]
["PC0803-Monarch - Humboldt-III","PC0803","Monarch - Humboldt","III",3.15]
["PC0809-Monarch - Humboldt-IL","PC0809","Monarch - Humboldt","IL",3.11,"I, II, IL"]
["PC1002-GCC - Rapid City-I/II","PC1002","GCC - Rapid City","I/II",3.14,"I, II, IL"]
["PC1003-GCC - Rapid City-III","PC1003","GCC - Rapid City","III",3.15]
["PC1008-GCC - Rapid City-IP(25)","PC1008","GCC - Rapid City","IP(25)",3.05,"IP, IS, IT"]
["PC1009-GCC - Rapid City-IL","PC1009","GCC - Rapid City","IL",3.11,"I, II, IL"]
["PC1309-Holcim- Joppa-IL","PC1309","Holcim- Joppa","IL",3.11,"I, II, IL"]
["PC1401-Buzzi - Pryor-I","PC1401","Buzzi - Pryor","I",3.14,"I, II, IL"]
["PC1409-Buzzi - Pryor-IL","PC1409","Buzzi - Pryor","IL",3.11,"I, II, IL"]
["PC1502-Buzzi - Cape Girardeau-I/II","PC1502","Buzzi - Cape Girardeau","I/II",3.14,"I, II, IL"]
["PC1509-Buzzi - Cape Girardeau-IL","PC1509","Buzzi - Cape Girardeau","IL",3.11,"I, II, IL"]
["PC1702-St Marys - Ontario-II","PC1702","St Marys - Ontario","II",3.14,"I, II, IL"]
["PC1809-Holcim- Alpena-IL","PC1809","Holcim- Alpena","IL",3.11,"I, II, IL"]
["PC1909-Holcim- Ada-IL","PC1909","Holcim- Ada","IL",3.11,"I, II, IL"]
["PC2008-Holcim - Florence-IP(25)","PC2008","Holcim - Florence","IP(25)",3.01,"IP, IS, IT"]
["PC2806-Central Plains - EaglePave -IT(S38)(L7)","PC2806","Central Plains - EaglePave ","IT(S38)(L7)",3.05,"IP, IS, IT"]
["PC2816-Central Plains - Sugar Creek-IT(S25)(L9)","PC2816","Central Plains - Sugar Creek","IT(S25)(L9)",3.07,"IP, IS, IT"]
["PC2902-GCC - Pueblo-I/II","PC2902","GCC - Pueblo","I/II",3.14,"I, II, IL"]
["PC2909-GCC - Pueblo-IL","PC2909","GCC - Pueblo","IL",3.11,"I, II, IL"]
["PC3002-Buzzi - Festus-I/II","PC3002","Buzzi - Festus","I/II",3.14,"I, II, IL"]
["PC3009-Buzzi - Festus-IL","PC3009","Buzzi - Festus","IL",3.11,"I, II, IL"]
["PC3206-Holcim - ST. Gen-IT(P25)(L6)","PC3206","Holcim - ST. Gen","IT(P25)(L6)",2.85,"IP, IS, IT"]
["PC3209-Holcim - ST. Gen-IL","PC3209","Holcim - ST. Gen","IL",3.11,"I, II, IL"]
["PC3216-Holcim - ST. Gen-IT(S30)(P10)","PC3216","Holcim - ST. Gen","IT(S30)(P10)",2.96,"IP, IS, IT"]
["PC3302-Illinois-I/II","PC3302","Illinois","I/II",3.14,"I, II, IL"]
["PC3402-St Marys - Charlevoix-II","PC3402","St Marys - Charlevoix","II",3.14,"I, II, IL"]
["PC3602-GCC - Samalayuca-I/II","PC3602","GCC - Samalayuca","I/II",3.14,"I, II, IL"]
["PC3603-GCC - Samalayuca-III","PC3603","GCC - Samalayuca","III",3.15]
["PC3702-Ozinga-Song Lam JSC-I/II","PC3702","Ozinga-Song Lam JSC","I/II",3.14,"I, II, IL"]
["PC3802-Ozinga-Long Son Cement-I/II","PC3802","Ozinga-Long Son Cement","I/II",3.14,"I, II, IL"]
["PC3807-Ozinga-CarbonSense-IS(20)","PC3807","Ozinga-CarbonSense","IS(20)",3.12,"IP, IS, IT"]
["PC3909-Kosmos Cement-IL","PC3909","Kosmos Cement","IL",3.11,"I, II, IL"]

{"sheet":"FLYASH","index":22,"n_rows":54,"n_cols":5,"rows_kept":54,"cut":false,"hidden":true,"merged":[[0,0,1,4]]}
["Fly Ash"]
[]
[]
[{"$f":"_xlfn.CONCAT(B4, \"-\", C4)","v":"FA001C-Columbia Generating Station #1, #2 or Comb"},"FA001C","Columbia Generating Station #1, #2 or Comb","C",2.75]
[{"$f":"_xlfn.CONCAT(B5, \"-\", C5)","v":"FA003F-Coal Creek Micron 3"},"FA003F","Coal Creek Micron 3","F",2.63]
["FA003F-Coal Creek Power Plant","FA003F","Coal Creek Power Plant","F",2.48]
["FA004C-Council Bluffs Unit #3","FA004C","Council Bluffs Unit #3","C",2.62]
["FA005C-Iatan Generating Station, Unit #2 ","FA005C","Iatan Generating Station, Unit #2 ","C",2.68]
["FA007C-Iatan Generating Station, Unit #1","FA007C","Iatan Generating Station, Unit #1","C",2.78]
["FA009C-Louisa Generating Station","FA009C","Louisa Generating Station","C",2.69]
["FA010C-Muscatine Power & Water","FA010C","Muscatine Power & Water","C",2.76]
["FA011C-Nebraska City Station","FA011C","Nebraska City Station","C",2.73]
["FA012C-North Omaha Generating Station","FA012C","North Omaha Generating Station","C",2.68]
["FA013C-Ottumwa Generating Station","FA013C","Ottumwa Generating Station","C",2.75]
["FA015C-Port Neal Power Plant #3, #4 or Combined","FA015C","Port Neal Power Plant #3, #4 or Combined","C",2.66]
["FA017F-Joliet Generating Station","FA017F","Joliet Generating Station","F",2.54]
["FA018C-M.L. Kapp Generating Station","FA018C","M.L. Kapp Generating Station","C",2.73]
["FA020C-Edgewater Unit #5 Generating Station","FA020C","Edgewater Unit #5 Generating Station","C",2.78]
["FA022C-Labadie Power Plant Labadie","FA022C","Labadie Power Plant Labadie","C",2.73]
["FA025C-Thomas Hill Energy Center","FA025C","Thomas Hill Energy Center","C",2.7]
["FA026C-Weston Generating Station","FA026C","Weston Generating Station","C",2.64]
["FA028C-Gerald Gentleman Station, Unit #1","FA028C","Gerald Gentleman Station, Unit #1","C",2.67]
["FA032C-J.P. Madgett Station, Dairyland, Poz AC","FA032C","J.P. Madgett Station, Dairyland, Poz AC","C",2.7]
["FA033C-Northeastern Generating Station","FA033C","Northeastern Generating Station","C",2.68]
["FA034C-Genoa Power Station #3, Dairyland","FA034C","Genoa Power Station #3, Dairyland","C",2.7]
["FA035C-La Cygne Station Power Plant, Unit #2","FA035C","La Cygne Station Power Plant, Unit #2","C",2.64]
["FA036C-Montrose Station Power Plant, Unit #3","FA036C","Montrose Station Power Plant, Unit #3","C",2.67]
["FA037C-Elm Road Generating Station Combined","FA037C","Elm Road Generating Station Combined","C",2.7]
["FA038F-Petersburg Generating Station, Unit #3","FA038F","Petersburg Generating Station, Unit #3","F",2.52]
["FA039C-Clay Boswell Generating Station, Unit #3","FA039C","Clay Boswell Generating Station, Unit #3","C",2.61]
["FA041C-Prairie Creek Generating Station, Unit #3","FA041C","Prairie Creek Generating Station, Unit #3","C",2.8]
["FA042C-Muskogee Generating Station","FA042C","Muskogee Generating Station","C",2.69]
["FA043F-Durapoz F","FA043F","Durapoz F","F",2.5499999999999998]
["FA044C-Dynegy Newton Power Station","FA044C","Dynegy Newton Power Station","C",2.66]
["FA045C-Oak Creek Power Station","FA045C","Oak Creek Power Station","C",2.7]
["FA046F-Praire State Generating Station","FA046F","Praire State Generating Station","F",2.42]
["FA050C-Duck Creek Power Station","FA050C","Duck Creek Power Station","C",2.71]
["FA051C-North Shore Station","FA051C","North Shore Station","C",2.7]
["FA052C-Whelan Hastings Generation Plant, Unit 2","FA052C","Whelan Hastings Generation Plant, Unit 2","C",2.64]
["FA053C-Leland Olds Station, Unit 1","FA053C","Leland Olds Station, Unit 1","C",2.78]
["FA054F-P2P PSGC/Louisa Blend","FA054F","P2P PSGC/Louisa Blend","F",2.46]
["FA055F-CarbonSense CWLP F Ash","FA055F","CarbonSense CWLP F Ash","F",2.46]
["FA056C-Jeffery Energy Center ","FA056C","Jeffery Energy Center ","C",2.9]
["FA057C-Platte Generating Station","FA057C","Platte Generating Station","C",2.59]
["FA058F-Cumberland Power Station","FA058F","Cumberland Power Station","F",2.5]
["FA059C-Limestone Plant","FA059C","Limestone Plant","C",2.69]
["FA060F-Oak Grove Pozzolan","FA060F","Oak Grove Pozzolan","F",2.42]
["FA061C-Lawrence Power Plant","FA061C","Lawrence Power Plant","C",2.67]
["FA137F-Elm Road Generating Station Unit #1","FA137F","Elm Road Generating Station Unit #1","F",2.68]
["FA223C-CarbonSense C Ash","FA223C","CarbonSense C Ash","C",2.79]
["FA237F-Elm Road Generating Station Unit #2","FA237F","Elm Road Generating Station Unit #2","F",2.67]
["FA249C-Edwards Power Station, Unit#2","FA249C","Edwards Power Station, Unit#2","C",2.71]
["FA323F-CarbonSense F Ash","FA323F","CarbonSense F Ash","F",2.6]
["FA349C-Edwards Power Station, Unit#3","FA349C","Edwards Power Station, Unit#3","C",2.72]

{"sheet":"SLAG","index":23,"n_rows":7,"n_cols":5,"rows_kept":7,"cut":false,"hidden":true,"merged":[[0,0,1,4]]}
["Slag"]
[]
[]
[{"$f":"_xlfn.CONCAT(B4, \"-\", C4)","v":"SL00A-Skyway Cement"},"SL00A","Skyway Cement",2.87,100]
[{"$f":"_xlfn.CONCAT(B5, \"-\", C5)","v":"SL02A-NewCem"},"SL02A","NewCem",2.93,100]
[{"$f":"_xlfn.CONCAT(B6, \"-\", C6)","v":"SL05A-Carbon Smart Grade 100"},"SL05A","Carbon Smart Grade 100",2.95,100]
[{"$f":"_xlfn.CONCAT(B7, \"-\", C7)","v":"SL06A-Heidelberg Speed Plant"},"SL06A","Heidelberg Speed Plant",2.87,100]

{"sheet":"ADMIX-AIR","index":24,"n_rows":41,"n_cols":3,"rows_kept":41,"cut":false,"hidden":true,"merged":[[0,0,1,2]]}
["Air Entraining "]
[]
[]
[{"$f":"_xlfn.CONCAT(B4, \"-\", C4)","v":"Air Plus-Fritz-Pak"},"Air Plus","Fritz-Pak"]
[{"$f":"_xlfn.CONCAT(B5, \"-\", C5)","v":"Airalon 3000-GCP"},"Airalon 3000","GCP"]
["Airalon 7000-GCP","Airalon 7000","GCP"]
["Chryso Air 260-CHRYSO Inc","Chryso Air 260","CHRYSO Inc"]
["ConAir 260-Premiere Admix.","ConAir 260","Premiere Admix."]
["ConAir X-Premiere Admix.","ConAir X","Premiere Admix."]
["DSA 110-DarCole Products, Inc","DSA 110","DarCole Products, Inc"]
["Daravair 1000-GCP","Daravair 1000","GCP"]
["Daravair 1400-GCP","Daravair 1400","GCP"]
["Daravair AT 30-GCP","Daravair AT 30","GCP"]
["Daravair AT 60-GCP","Daravair AT 60","GCP"]
["Daravair M-GCP","Daravair M","GCP"]
["Darex II AEA-GCP","Darex II AEA","GCP"]
["Eucon AEA-92-Euclid","Eucon AEA-92","Euclid"]
["Eucon AEA-92S-Euclid","Eucon AEA-92S","Euclid"]
["Eucon Air MAC12-Euclid","Eucon Air MAC12","Euclid"]
["Eucon Air MAC6-Euclid","Eucon Air MAC6","Euclid"]
["Eucon Air Mix-Euclid","Eucon Air Mix","Euclid"]
[{"$f":"_xlfn.CONCAT(B22, \"-\", C22)","v":"Mapeair SA-Mapei"},"Mapeair SA","Mapei"]
[{"$f":"_xlfn.CONCAT(B23, \"-\", C23)","v":"Mapeair SA-50-Mapei"},"Mapeair SA-50","Mapei"]
[{"$f":"_xlfn.CONCAT(B24, \"-\", C24)","v":"Mapeair VR-Mapei"},"Mapeair VR","Mapei"]
["MasterAir AE 200-Master Builders","MasterAir AE 200","Master Builders"]
["MasterAir AE 400-Master Builders","MasterAir AE 400","Master Builders"]
["MasterAir AE 90-Master Builders","MasterAir AE 90","Master Builders"]
["MasterAir VR 10-Master Builders","MasterAir VR 10","Master Builders"]
["Miracon 2315-Miracon Tech.","Miracon 2315","Miracon Tech."]
["Polychem SA-14-Mapei","Polychem SA-14","Mapei"]
["RAE-260-RussTech, Inc.","RAE-260","RussTech, Inc."]
["RSA-10-RussTech, Inc.","RSA-10","RussTech, Inc."]
["Sika AEA-14-Sika","Sika AEA-14","Sika"]
["Sika AER-C-Sika","Sika AER-C","Sika"]
["Sika Air-Sika","Sika Air","Sika"]
["Sika Air-260-Sika","Sika Air-260","Sika"]
["Sika Air-360-Sika","Sika Air-360","Sika"]
["SikaControl AIR-160-Sika","SikaControl AIR-160","Sika"]
["Stable Air-CCT","Stable Air","CCT"]
["Super Air Plus-Fritz-Pak","Super Air Plus","Fritz-Pak"]
["Terapave AEA-GCP","Terapave AEA","GCP"]

{"sheet":"ADMIX-WR","index":25,"n_rows":65,"n_cols":3,"rows_kept":65,"cut":false,"hidden":true,"merged":[[0,0,1,2]]}
["Normal Water Reducer"]
[]
[]
[{"$f":"_xlfn.CONCAT(B4, \"-\", C4)","v":"ADVA 140M-GCP"},"ADVA 140M","GCP"]
[{"$f":"_xlfn.CONCAT(B5, \"-\", C5)","v":"ADVA Cast 600-GCP"},"ADVA Cast 600","GCP"]
[{"$f":"_xlfn.CONCAT(B6, \"-\", C6)","v":"Accelguard G3-Euclid"},"Accelguard G3","Euclid"]
[{"$f":"_xlfn.CONCAT(B7, \"-\", C7)","v":"Chryso Fluid Optima 256-CHRYSO"},"Chryso Fluid Optima 256","CHRYSO"]
["Chryso Optima 249-CHRYSO","Chryso Optima 249","CHRYSO"]
["Clarena MC 2000-GCP","Clarena MC 2000","GCP"]
["Concera SA8080-GCP","Concera SA8080","GCP"]
["DNL 485-DarCole Products, Inc","DNL 485","DarCole Products, Inc"]
["DNL 785-DarCole Products, Inc","DNL 785","DarCole Products, Inc"]
["Dynamon 850-Mapei","Dynamon 850","Mapei"]
["Dynamon NRG 1092-Mapei","Dynamon NRG 1092","Mapei"]
["Dynamon NRG 546-Mapei","Dynamon NRG 546","Mapei"]
["Dynamon SX-Mapei","Dynamon SX","Mapei"]
["Eucon MRX-Euclid","Eucon MRX","Euclid"]
["Eucon SE-Euclid","Eucon SE","Euclid"]
["Eucon WR-Euclid","Eucon WR","Euclid"]
["Eucon WR-75-Euclid","Eucon WR-75","Euclid"]
["Eucon WR-91-Euclid","Eucon WR-91","Euclid"]
["Eucon X-15-Euclid","Eucon X-15","Euclid"]
["Extendflo X90-RussTech","Extendflo X90","RussTech"]
["FinishEase-NC-RussTech","FinishEase-NC","RussTech"]
["LC-400P-RussTech","LC-400P","RussTech"]
["MIRA 62-GCP","MIRA 62","GCP"]
["MIRA 95-GCP","MIRA 95","GCP"]
["Mapefluid N200-Mapei","Mapefluid N200","Mapei"]
["Mapeplast 400 NC-Mapei","Mapeplast 400 NC","Mapei"]
["Mapeplast KB 1200-Mapei","Mapeplast KB 1200","Mapei"]
["Mapeplast MR 107-Mapei","Mapeplast MR 107","Mapei"]
["Mapeplast N-Mapei","Mapeplast N","Mapei"]
["Mapeplast Paver Plus-Mapei","Mapeplast Paver Plus","Mapei"]
["Master X-Seed 66-21st Century","Master X-Seed 66","21st Century"]
["MasterEase 5000-Master Builders","MasterEase 5000","Master Builders"]
["MasterGlenium 1466-Master Builders","MasterGlenium 1466","Master Builders"]
["MasterGlenium 3030-Master Builders","MasterGlenium 3030","Master Builders"]
["MasterGlenium 7920-Master Builders","MasterGlenium 7920","Master Builders"]
["MasterPolyheed 900-Master Builders","MasterPolyheed 900","Master Builders"]
["MasterPolyheed 997-Master Builders","MasterPolyheed 997","Master Builders"]
["MasterPozzolith 200-Master Builders","MasterPozzolith 200","Master Builders"]
["MasterPozzolith 322-Master Builders","MasterPozzolith 322","Master Builders"]
["MasterPozzolith 700-Master Builders","MasterPozzolith 700","Master Builders"]
["MasterPozzolith 80-Master Builders","MasterPozzolith 80","Master Builders"]
["Melchem 38-Mapei","Melchem 38","Mapei"]
["OptiFlo 500-Premiere Admix","OptiFlo 500","Premiere Admix"]
["OptiFlo 700-Premiere Admix","OptiFlo 700","Premiere Admix"]
["OpiFlo MR-Premiere Admix","OpiFlo MR","Premiere Admix"]
[{"$f":"_xlfn.CONCAT(B49, \"-\", C49)","v":"Plastol 6420-Euclid"},"Plastol 6420","Euclid"]
[{"$f":"_xlfn.CONCAT(B50, \"-\", C50)","v":"Plastol 6425-Euclid"},"Plastol 6425","Euclid"]
["Polychem 3000-Mapei","Polychem 3000","Mapei"]
["Sika Plastocrete 10N-Sika","Sika Plastocrete 10N","Sika"]
["Sika Plastocrete 161-Sika","Sika Plastocrete 161","Sika"]
["Sika Plastocrete-250-Sika","Sika Plastocrete-250","Sika"]
[{"$f":"_xlfn.CONCAT(B55, \"-\", C55)","v":"Sika ViscoFlow-2020-Sika"},"Sika ViscoFlow-2020","Sika"]
[{"$f":"_xlfn.CONCAT(B56, \"-\", C56)","v":"Sika Viscocrete-1100-Sika"},"Sika Viscocrete-1100","Sika"]
["Sikament 686-Sika","Sikament 686","Sika"]
["Sikament-475-Sika","Sikament-475","Sika"]
["Superflo 2000 RM-RussTech","Superflo 2000 RM","RussTech"]
["Superflo 2000 SCC-RussTech","Superflo 2000 SCC","RussTech"]
["Superflo 2040 RM-RussTech","Superflo 2040 RM","RussTech"]
["WRDA 82-GCP","WRDA 82","GCP"]
["ZYLA 620-GCP","ZYLA 620","GCP"]
["ZYLA 630-GCP","ZYLA 630","GCP"]
["ZYLA 640-GCP","ZYLA 640","GCP"]

{"sheet":"ADMIX-MR","index":26,"n_rows":36,"n_cols":3,"rows_kept":36,"cut":false,"hidden":true,"merged":[[0,0,1,2]]}
["Mid Range Water Reducers"]
[]
[]
[{"$f":"_xlfn.CONCAT(B4, \"-\", C4)","v":"ADVA 140M-GCP"},"ADVA 140M","GCP"]
["ADVA Cast 575-GCP","ADVA Cast 575","GCP"]
["ADVA Cast 600-GCP","ADVA Cast 600","GCP"]
["Chryso Fluid Optima 256-CHRYSO","Chryso Fluid Optima 256","CHRYSO"]
["Dynamon 850-Mapei","Dynamon 850","Mapei"]
["Dynamon SX-Mapei","Dynamon SX","Mapei"]
["Eucon MR-Euclid","Eucon MR","Euclid"]
["Eucon MRX-Euclid","Eucon MRX","Euclid"]
["Eucon X-15-Euclid","Eucon X-15","Euclid"]
["FinishEase-NC-RussTech","FinishEase-NC","RussTech"]
["MIRA 110-GCP","MIRA 110","GCP"]
["MIRA 62-GCP","MIRA 62","GCP"]
["MIRA 95-GCP","MIRA 95","GCP"]
["Mapeplast KB 1200-Mapei","Mapeplast KB 1200","Mapei"]
["Mapeplast MR 107-Mapei","Mapeplast MR 107","Mapei"]
["MasterGlenium 3030-Master Builders","MasterGlenium 3030","Master Builders"]
["MasterGlenium 7500-Master Builders","MasterGlenium 7500","Master Builders"]
["MasterPolyheed 1020-Master Builders","MasterPolyheed 1020","Master Builders"]
["MasterPolyheed 1025-Master Builders","MasterPolyheed 1025","Master Builders"]
["MasterPolyheed 1720-Master Builders","MasterPolyheed 1720","Master Builders"]
["MasterPolyheed 1725-Master Builders","MasterPolyheed 1725","Master Builders"]
["MasterPolyheed 900-Master Builders","MasterPolyheed 900","Master Builders"]
["MasterPolyheed 997-Master Builders","MasterPolyheed 997","Master Builders"]
["OptiFlo MR-Premiere Admix","OptiFlo MR","Premiere Admix"]
["OptiFlo 700-Premiere Admix","OptiFlo 700","Premiere Admix"]
["Plastol 6420-Euclid","Plastol 6420","Euclid"]
["Polychem 3000-Mapei","Polychem 3000","Mapei"]
["Sika ViscoFlow 2020-Sika","Sika ViscoFlow 2020","Sika"]
["Sika ViscoCrete 1000-Sika","Sika ViscoCrete 1000","Sika"]
["Sikament AFM-Sika","Sikament AFM","Sika"]
[{"$f":"_xlfn.CONCAT(B34, \"-\", C34)","v":"Sikament-475-Sika"},"Sikament-475","Sika"]
[{"$f":"_xlfn.CONCAT(B35, \"-\", C35)","v":"Sikaplast 200-Sika"},"Sikaplast 200","Sika"]
[{"$f":"_xlfn.CONCAT(B36, \"-\", C36)","v":"Sikaplast 300GP-Sika"},"Sikaplast 300GP","Sika"]

{"sheet":"ADMIX-HR","index":27,"n_rows":67,"n_cols":3,"rows_kept":67,"cut":false,"hidden":true,"merged":[[0,0,1,2]]}
["High Range Water Reducers"]
[]
[]
[{"$f":"_xlfn.CONCAT(B4, \"-\", C4)","v":"ADVA 140M-GCP"},"ADVA 140M","GCP"]
[{"$f":"_xlfn.CONCAT(B5, \"-\", C5)","v":"ADVA 190-GCP"},"ADVA 190","GCP"]
["ADVA 195-GCP","ADVA 195","GCP"]
["ADVA 198-GCP","ADVA 198","GCP"]
["ADVA 405-GCP","ADVA 405","GCP"]
["ADVA Cast 555-GCP","ADVA Cast 555","GCP"]
["ADVA Cast 575-GCP","ADVA Cast 575","GCP"]
["ADVA Cast 585-GCP","ADVA Cast 585","GCP"]
["ADVA Cast 600-GCP","ADVA Cast 600","GCP"]
["ADVA ITM750-GCP","ADVA ITM750","GCP"]
["ADVA Cast 593-GCP","ADVA Cast 593","GCP"]
["Chryso Fluid Optima 256-CHRYSO","Chryso Fluid Optima 256","CHRYSO"]
["Chryso Optima 249-CHRYSO","Chryso Optima 249","CHRYSO"]
["Clarena MC 2000-GCP","Clarena MC 2000","GCP"]
["Concera SA8080-GCP","Concera SA8080","GCP"]
["Daracem 19-GCP","Daracem 19","GCP"]
["Dynamon 850-Mapei","Dynamon 850","Mapei"]
["Dynamon NRG 1092-Mapei","Dynamon NRG 1092","Mapei"]
["Dynamon NRG 546-Mapei","Dynamon NRG 546","Mapei"]
["Dynamon SX-Mapei","Dynamon SX","Mapei"]
["Dynamon SX 37-Mapei","Dynamon SX 37","Mapei"]
["Eucon 1037-Euclid","Eucon 1037","Euclid"]
["Eucon 37-Euclid","Eucon 37","Euclid"]
["Eucon MRX-Euclid","Eucon MRX","Euclid"]
["MIRA 110-GCP","MIRA 110","GCP"]
["MIRA 62-GCP","MIRA 62","GCP"]
["Mapecrete Resolve-Mapei","Mapecrete Resolve","Mapei"]
["Mapefluid N200-Mapei","Mapefluid N200","Mapei"]
["MasterGlenium 1466-Master Builders","MasterGlenium 1466","Master Builders"]
["MasterGlenium 3030-Master Builders","MasterGlenium 3030","Master Builders"]
["MasterGlenium 3400-Master Builders","MasterGlenium 3400","Master Builders"]
["MasterGlenium 7500-Master Builders","MasterGlenium 7500","Master Builders"]
["MasterGlenium 7700-Master Builders","MasterGlenium 7700","Master Builders"]
["MasterGlenium 7920-Master Builders","MasterGlenium 7920","Master Builders"]
["MasterRheobuild 1000-Master Builders","MasterRheobuild 1000","Master Builders"]
["Melchem 38-Mapei","Melchem 38","Mapei"]
["Plastol 341-Euclid","Plastol 341","Euclid"]
["Plastol 341-S-Euclid","Plastol 341-S","Euclid"]
["Plastol 5000-Euclid","Plastol 5000","Euclid"]
["Plastol 6400-Euclid","Plastol 6400","Euclid"]
["Plastol 6420-Euclid","Plastol 6420","Euclid"]
["Plastol 6425-Euclid","Plastol 6425","Euclid"]
["Plastol Ultra 209-Euclid","Plastol Ultra 209","Euclid"]
["Polychem 3000-Mapei","Polychem 3000","Mapei"]
["Polychem SPC-Mapei","Polychem SPC","Mapei"]
["Sika ViscoCrete 1000-Sika","Sika ViscoCrete 1000","Sika"]
["Sika ViscoCrete 1100-Sika","Sika ViscoCrete 1100","Sika"]
["Sika ViscoCrete 2100-Sika","Sika ViscoCrete 2100","Sika"]
["Sika ViscoCrete 2110-Sika","Sika ViscoCrete 2110","Sika"]
["Sika ViscoCrete 4100-Sika","Sika ViscoCrete 4100","Sika"]
["Sika ViscoCrete 6100-Sika","Sika ViscoCrete 6100","Sika"]
["Sikament 686-Sika","Sikament 686","Sika"]
["Sikament AFM-Sika","Sikament AFM","Sika"]
["Sikament SPMN-Sika","Sikament SPMN","Sika"]
["Sikament-475-Sika","Sikament-475","Sika"]
["Supercizer 5 -Fritz-Pak","Supercizer 5 ","Fritz-Pak"]
["Supercizer 7-Fritz-Pak","Supercizer 7","Fritz-Pak"]
["Superflo 2000 RM-RussTech","Superflo 2000 RM","RussTech"]
["Superflo 2000 SCC-RussTech","Superflo 2000 SCC","RussTech"]
["Superflo 2040 RM-RussTech","Superflo 2040 RM","RussTech"]
["Superflo DSF 1443-DarCole Products, Inc","Superflo DSF 1443","DarCole Products, Inc"]
["UltraFlo 2000-Premiere Admix","UltraFlo 2000","Premiere Admix"]
["UltraFlo 5600-Premiere Admix","UltraFlo 5600","Premiere Admix"]
["UltraFlo DP-Premiere Admix","UltraFlo DP","Premiere Admix"]

{"sheet":"ADMIX-RETARDER","index":28,"n_rows":42,"n_cols":3,"rows_kept":42,"cut":false,"hidden":true,"merged":[[0,0,1,2]]}
["Retarder"]
[]
[]
[{"$f":"_xlfn.CONCAT(B4,\"-\",C4)","v":"DHS-DarCole Products"},"DHS","DarCole Products"]
[{"$f":"_xlfn.CONCAT(B5,\"-\",C5)","v":"DWR 385R-DarCole Products"},"DWR 385R","DarCole Products"]
["Daratard 17-GCP","Daratard 17","GCP"]
[{"$f":"_xlfn.CONCAT(B7,\"-\",C7)","v":"Eucon DS-Euclid"},"Eucon DS","Euclid"]
[{"$f":"_xlfn.CONCAT(B8,\"-\",C8)","v":"Eucon Retarder 100-Euclid"},"Eucon Retarder 100","Euclid"]
["Eucon SE-Euclid","Eucon SE","Euclid"]
["Eucon Stasis-Euclid","Eucon Stasis","Euclid"]
["Eucon WR-91-Euclid","Eucon WR-91","Euclid"]
["LC-400P-RussTech","LC-400P","RussTech"]
["LC-400R-RussTech","LC-400R","RussTech"]
["Mapecrete Resolve-Mapei","Mapecrete Resolve","Mapei"]
["Mapeplast 400 NC-Mapei","Mapeplast 400 NC","Mapei"]
["Mapeplast N-Mapei","Mapeplast N","Mapei"]
["Mapetard Plus-Mapei","Mapetard Plus","Mapei"]
["Mapetard R-Mapei","Mapetard R","Mapei"]
["MasterPozzolith 200-Master Builders US","MasterPozzolith 200","Master Builders US"]
["MasterPozzolith 322-Master Builders US","MasterPozzolith 322","Master Builders US"]
["MasterPozzolith 700-Master Builders US","MasterPozzolith 700","Master Builders US"]
["MasterPozzolith 80-Master Builders US","MasterPozzolith 80","Master Builders US"]
["MasterSet Delvo-Master Builders US","MasterSet Delvo","Master Builders US"]
["MasterSet Delvo ESC-Master Builders US","MasterSet Delvo ESC","Master Builders US"]
["MasterSet R 100-Master Builders US","MasterSet R 100","Master Builders US"]
["MasterSet R 300-BASF","MasterSet R 300","BASF"]
["Mini Delayed Set-Fritz-Pak","Mini Delayed Set","Fritz-Pak"]
["OptiFlo 500-Premiere Admix","OptiFlo 500","Premiere Admix"]
["Polychem Renu-Mapei","Polychem Renu","Mapei"]
["ProLong L-Premiere Admix","ProLong L","Premiere Admix"]
["RENU-RussTech","RENU","RussTech"]
["RECOVER-GCP","RECOVER","GCP"]
["Sika Plastiment-Sika","Sika Plastiment","Sika"]
["Sika Plastiment XR-Sika","Sika Plastiment XR","Sika"]
["Sika Plastocrete 10N-Sika","Sika Plastocrete 10N","Sika"]
["Sika Plastocrete 161-Sika","Sika Plastocrete 161","Sika"]
["Sika Plastocrete-250-Sika","Sika Plastocrete-250","Sika"]
["SikaTard 440-Sika","SikaTard 440","Sika"]
["Standard Delayed Set-Fritz-Pak","Standard Delayed Set","Fritz-Pak"]
["V-Mar VSC 500-GCP","V-Mar VSC 500","GCP"]
["Zyla 640-GCP","Zyla 640","GCP"]
["Zyla R-GCP","Zyla R","GCP"]

{"sheet":"ADMIX-SP","index":29,"n_rows":31,"n_cols":3,"rows_kept":31,"cut":false,"hidden":true,"merged":[[0,0,1,2]]}
["Special Performance"]
[]
[]
[{"$f":"_xlfn.CONCAT(B4,\"-\",C4)","v":"ADVA ITM750-GCP"},"ADVA ITM750","GCP"]
[{"$f":"_xlfn.CONCAT(B5,\"-\",C5)","v":"CSXtreme-Concrete Moisture Solutions"},"CSXtreme","Concrete Moisture Solutions"]
[{"$f":"_xlfn.CONCAT(B6,\"-\",C6)","v":"DG-F-Mapei"},"DG-F","Mapei"]
[{"$f":"_xlfn.CONCAT(B7,\"-\",C7)","v":"E5 Internal Cure-Specification Products"},"E5 Internal Cure","Specification Products"]
["E5 Liquid FlyAsh-Specification Products","E5 Liquid FlyAsh","Specification Products"]
["Eucon AWA-P20-Euclid","Eucon AWA-P20","Euclid"]
["Hycrete X1002-Hycrete","Hycrete X1002","Hycrete"]
["Mapecrete V3K-Mapei","Mapecrete V3K","Mapei"]
["Mapecrete VMA-Mapei","Mapecrete VMA","Mapei"]
["Master X-Seed 44-Master Builders","Master X-Seed 44","Master Builders"]
["Master X-Seed 55-Master Builders","Master X-Seed 55","Master Builders"]
["Master X-Seed 66-Master Builders","Master X-Seed 66","Master Builders"]
["MasterMatrix VMA 358-Master Builders","MasterMatrix VMA 358","Master Builders"]
["MasterMatrix VMA 362-Master Builders","MasterMatrix VMA 362","Master Builders"]
["MasterPel 240-Master Builders","MasterPel 240","Master Builders"]
["MasterSure Z-60-Master Builders","MasterSure Z-60","Master Builders"]
["Penetron Admix SB-Penrtron USA","Penetron Admix SB","Penrtron USA"]
["Sika WT-240 P-Sika","Sika WT-240 P","Sika"]
["SikaControl NS-Sika","SikaControl NS","Sika"]
["SikaControl SC-Sika","SikaControl SC","Sika"]
["Slick-Pak-Fritz-Pak","Slick-Pak","Fritz-Pak"]
["Slick-Pak II-Fritz-Pak","Slick-Pak II","Fritz-Pak"]
["Stabilizer-4R-Sika","Stabilizer-4R","Sika"]
["Super Slump Buster-Fritz-Pak","Super Slump Buster","Fritz-Pak"]
["V-Mar 3-GCP","V-Mar 3","GCP"]
["V-Mar F100-GCP","V-Mar F100","GCP"]
["VMA-758-RussTech, Inc","VMA-758","RussTech, Inc"]
["Visctrol-Euclid","Visctrol","Euclid"]

{"sheet":"FIBERS","index":30,"n_rows":38,"n_cols":3,"rows_kept":38,"cut":false,"hidden":true,"merged":[[0,0,1,2]]}
["Concrete Fibers"]
[]
[]
[{"$f":"_xlfn.CONCAT(B4,\"-\",C4)","v":"AC 50-ICF Concrete Additives"},"AC 50","ICF Concrete Additives"]
["AC 60-ICF Concrete Additives","AC 60","ICF Concrete Additives"]
["BarChip 48-BarChip USA","BarChip 48","BarChip USA"]
["BarChip 54-BarChip USA","BarChip 54","BarChip USA"]
["Enduro Prime 55-Sika","Enduro Prime 55","Sika"]
[{"$f":"_xlfn.CONCAT(B9,\"-\",C9)","v":"FIB-300-Sika"},"FIB-300","Sika"]
[{"$f":"_xlfn.CONCAT(B10,\"-\",C10)","v":"FIB 300 FabPro-FabPro Polymers"},"FIB 300 FabPro","FabPro Polymers"]
["FiberForce 300-ABC","FiberForce 300","ABC"]
["FiberForce 750-ABC","FiberForce 750","ABC"]
["Fibermesh 300-Sika","Fibermesh 300","Sika"]
["Forta-Ferro-Forta","Forta-Ferro","Forta"]
["GRT Polymesh Fibrillated Fiber-Mapei","GRT Polymesh Fibrillated Fiber","Mapei"]
[{"$f":"_xlfn.CONCAT(B16,\"-\",C16)","v":"Genesis Fibrillated-FabPro Polymers"},"Genesis Fibrillated","FabPro Polymers"]
["Genesis XF-FabPro Polymers","Genesis XF","FabPro Polymers"]
["MapeFibre ST 42-Mapei","MapeFibre ST 42","Mapei"]
["MapeFibre ST 50 Twisted-Mapei","MapeFibre ST 50 Twisted","Mapei"]
["MasterFiber F 100-Master Builders","MasterFiber F 100","Master Builders"]
["MasterFiber F 70-Master Builders","MasterFiber F 70","Master Builders"]
["MasterFiber MAC 100-Master Builders","MasterFiber MAC 100","Master Builders"]
["MasterFiber MAC 360 FF-Master Builders","MasterFiber MAC 360 FF","Master Builders"]
["MasterFiber MAC Matrix-Master Builders","MasterFiber MAC Matrix","Master Builders"]
["MONO 150-Sika","MONO 150","Sika"]
[{"$f":"_xlfn.CONCAT(B26,\"-\",C26)","v":"Performax-FabPro Polymers"},"Performax","FabPro Polymers"]
[{"$f":"_xlfn.CONCAT(B27,\"-\",C27)","v":"Performax HT-FabPro Polymers"},"Performax HT","FabPro Polymers"]
[{"$f":"_xlfn.CONCAT(B28,\"-\",C28)","v":"Plexus 44F-FabPro Polymers"},"Plexus 44F","FabPro Polymers"]
["Plexus 54F-FabPro Polymers","Plexus 54F","FabPro Polymers"]
["Polymesh M-Mapei","Polymesh M","Mapei"]
["PSI Fiberstrand F-Euclid","PSI Fiberstrand F","Euclid"]
["SikaFiber 800 Stealth-Sika","SikaFiber 800 Stealth","Sika"]
["Sinta F19-GCP","Sinta F19","GCP"]
["STRUX 75/32-GCP","STRUX 75/32","GCP"]
["STRUX 90/40-GCP","STRUX 90/40","GCP"]
["TUF-STRAND SF-Euclid","TUF-STRAND SF","Euclid"]
["TUF-STRAND SupermMix 41F-Euclid","TUF-STRAND SupermMix 41F","Euclid"]
["TUF-STRAND SuperMix SP-Euclid","TUF-STRAND SuperMix SP","Euclid"]

{"sheet":"ADMIX-FF","index":31,"n_rows":15,"n_cols":3,"rows_kept":15,"cut":false,"hidden":true,"merged":[[0,0,1,2]]}
["Flowable Fill"]
[]
[]
[{"$f":"_xlfn.CONCAT(B4, \"-\", C4)","v":"Aerlite-Aerix Industries"},"Aerlite","Aerix Industries"]
[{"$f":"_xlfn.CONCAT(B5, \"-\", C5)","v":"Cretefoam CMX-Richway Ind."},"Cretefoam CMX","Richway Ind."]
[{"$f":"_xlfn.CONCAT(B6, \"-\", C6)","v":"DNF 842-DarCole Pro."},"DNF 842","DarCole Pro."]
["Darafill-GCP","Darafill","GCP"]
["Eucon Easy Fill-Euclid","Eucon Easy Fill","Euclid"]
["FLO-L-Premiere","FLO-L","Premiere"]
["Fill Flow-Fritz-Pak Corp.","Fill Flow","Fritz-Pak Corp."]
["Lightcrete-Sika","Lightcrete","Sika"]
["Mapeair LA/L-Mapei","Mapeair LA/L","Mapei"]
["MasterCell 25-Master Builders","MasterCell 25","Master Builders"]
["RUSS-FLO-RussTech","RUSS-FLO","RussTech"]
["Stable Air-CCT","Stable Air","CCT"]

{"sheet":"COUNTIES","index":32,"n_rows":102,"n_cols":3,"rows_kept":102,"cut":false,"hidden":true,"merged":[[0,0,1,2]]}
["Counties"]
[]
[]
[{"$f":"_xlfn.CONCAT(B4, \"-\", C4)","v":"01-Adair"},"01","Adair"]
[{"$f":"_xlfn.CONCAT(B5, \"-\", C5)","v":"02-Adams"},"02","Adams"]
["03-Allamakee","03","Allamakee"]
["04-Appanoose","04","Appanoose"]
["05-Audubon","05","Audubon"]
["06-Benton","06","Benton"]
["07-Black Hawk","07","Black Hawk"]
["08-Boone","08","Boone"]
["09-Bremer","09","Bremer"]
["10-Buchanan","10","Buchanan"]
["11-Buena Vista","11","Buena Vista"]
["12-Butler","12","Butler"]
["13-Calhoun","13","Calhoun"]
["14-Carroll","14","Carroll"]
["15-Cass","15","Cass"]
["16-Cedar","16","Cedar"]
["17-Cerro Gordo","17","Cerro Gordo"]
["18-Cherokee","18","Cherokee"]
["19-Chickasaw","19","Chickasaw"]
["20-Clarke","20","Clarke"]
["21-Clay","21","Clay"]
["22-Clayton","22","Clayton"]
["23-Clinton","23","Clinton"]
["24-Crawford","24","Crawford"]
["25-Dallas","25","Dallas"]
["26-Davis","26","Davis"]
["27-Decatur","27","Decatur"]
["28-Delaware","28","Delaware"]
["29-Des Moines","29","Des Moines"]
["30-Dickinson","30","Dickinson"]
["31-Dubuque","31","Dubuque"]
["32-Emmet","32","Emmet"]
["33-Fayette","33","Fayette"]
["34-Floyd","34","Floyd"]
["35-Franklin","35","Franklin"]
["36-Fremont","36","Fremont"]
["37-Greene","37","Greene"]
["38-Grundy","38","Grundy"]
["39-Guthrie","39","Guthrie"]
["40-Hamilton","40","Hamilton"]
["41-Hancock","41","Hancock"]
["42-Hardin","42","Hardin"]
["43-Harrison","43","Harrison"]
["44-Henry","44","Henry"]
["45-Howard","45","Howard"]
["46-Humboldt","46","Humboldt"]
["47-Ida","47","Ida"]
["48-Iowa","48","Iowa"]
["49-Jackson","49","Jackson"]
["50-Jasper","50","Jasper"]
["51-Jefferson","51","Jefferson"]
["52-Johnson","52","Johnson"]
["53-Jones","53","Jones"]
["54-Keokuk","54","Keokuk"]
["55-Kossuth","55","Kossuth"]
["56-Lee","56","Lee"]
["57-Linn","57","Linn"]
["58-Louisa","58","Louisa"]
["59-Lucas","59","Lucas"]
["60-Lyon","60","Lyon"]
["61-Madison","61","Madison"]
["62-Mahaska","62","Mahaska"]
["63-Marion","63","Marion"]
["64-Marshall","64","Marshall"]
["65-Mills","65","Mills"]
[{"$f":"_xlfn.CONCAT(B69, \"-\", C69)","v":"66-Mitchell"},"66","Mitchell"]
["67-Monona","67","Monona"]
["68-Monroe","68","Monroe"]
["69-Montgomery","69","Montgomery"]
["70-Muscatine","70","Muscatine"]
["71-O'Brien","71","O'Brien"]
["72-Osceola","72","Osceola"]
["73-Page","73","Page"]
["74-Palo Alto","74","Palo Alto"]
["75-Plymouth","75","Plymouth"]
["76-Pocahontas","76","Pocahontas"]
["77-Polk","77","Polk"]
["78-Pottawattamie","78","Pottawattamie"]
["79-Poweshiek","79","Poweshiek"]
["80-Ringgold","80","Ringgold"]
["81-Sac","81","Sac"]
["82-Scott","82","Scott"]
["83-Shelby","83","Shelby"]
["84-Sioux","84","Sioux"]
["85-Story","85","Story"]
["86-Tama","86","Tama"]
["87-Taylor","87","Taylor"]
["88-Union","88","Union"]
["89-Van Buren","89","Van Buren"]
["90-Wapello","90","Wapello"]
["91-Warren","91","Warren"]
["92-Washington","92","Washington"]
["93-Wayne","93","Wayne"]
["94-Webster","94","Webster"]
["95-Winnebago","95","Winnebago"]
["96-Winneshiek","96","Winneshiek"]
["97-Woodbury","97","Woodbury"]
["98-Worth","98","Worth"]
["99-Wright","99","Wright"]

{"sheet":"ADMIX-CO2","index":33,"n_rows":5,"n_cols":3,"rows_kept":5,"cut":false,"hidden":true,"merged":[[0,0,1,2]]}
["CO2 ADMIX"]
[]
[]
[{"$f":"_xlfn.CONCAT(B4,\"-\",C4)","v":"CarbonCure-CarbonCure Tech."},"CarbonCure","CarbonCure Tech."]
[{"$f":"_xlfn.CONCAT(B5,\"-\",C5)","v":"CarbonJect-CRH"},"CarbonJect","CRH"]

{"sheet":"ALL ELSE","index":34,"n_rows":28,"n_cols":11,"rows_kept":28,"cut":false,"hidden":true,"merged":[]}
[]
[null,null,null,null,null,null,null,null,null,{"$f":"IF('Proj Info'!B25=\"X\",\"\",\"X\")","v":"X"}]
[]
[null,null,null,null,null,null,null,null,null,{"$f":"IF('Proj Info'!B26=\"X\",\"\",\"X\")","v":"X"}]
[2,null,2,1,null,1.5,null,null,null,null,"X"]
[3,null,6,7,null,2.5]
[4,null,null,null,null,null,null,null,null,{"$f":"IF(OR('Proj Info'!B29=\"X\", 'Proj Info'!B31=\"X\", 'Proj Info'!B32=\"X\"),\"\",\"X\")","v":"X"}]
[5,null,"Flexural",null,null,{"$f":"IF('Proj Info'!B18=\"Flexural\", 500, IF('Proj Info'!B18=\"Compressive\", 4500,\"\"))","v":""}]
[6,null,"Compressive",null,null,{"$f":"IF('Proj Info'!B18=\"Flexural\", 575, IF('Proj Info'!B18=\"Compressive\", 5000,\"\"))","v":""},null,null,null,{"$f":"IF(OR('Proj Info'!B27=\"X\", 'Proj Info'!B31=\"X\", 'Proj Info'!B32=\"X\"),\"\",\"X\")","v":"X"}]
[null,null,null,null,null,{"$f":"IF('Proj Info'!B18=\"Compressive\", 5500,\"\")","v":""}]
[null,null,null,null,null,{"$f":"IF('Proj Info'!B18=\"Compressive\", 6000,\"\")","v":""},null,null,null,{"$f":"IF(OR('Proj Info'!B27=\"X\", 'Proj Info'!B29=\"X\", 'Proj Info'!B32=\"X\"),\"\",\"X\")","v":"X"}]
[null,null,null,null,null,{"$f":"IF('Proj Info'!B18=\"Compressive\", 6500,\"\")","v":""}]
[null,null,null,null,null,{"$f":"IF('Proj Info'!B18=\"Compressive\", 7000,\"\")","v":""},null,null,null,{"$f":"IF(OR('Proj Info'!B27=\"X\", 'Proj Info'!B29=\"X\", 'Proj Info'!B31=\"X\"),\"\",\"X\")","v":"X"}]
[null,null,null,null,null,{"$f":"IF('Proj Info'!B18=\"Compressive\", 7500,\"\")","v":""}]
[null,null,null,null,null,{"$f":"IF('Proj Info'!B18=\"Compressive\", 8000,\"\")","v":""},null,null,null,{"$f":"IF('Proj Info'!B29=\"X\", \"Bridge Deck\",\"\")","v":""}]
[null,null,null,null,null,{"$f":"IF('Proj Info'!B18=\"Compressive\", 8500,\"\")","v":""},null,null,null,{"$f":"IF('Proj Info'!B29=\"X\", \"Other\",\"\")","v":""}]
[null,null,null,null,null,{"$f":"IF('Proj Info'!B18=\"Compressive\", 9000,\"\")","v":""}]
[null,null,null,null,null,null,null,null,null,{"$f":"IF('Proj Info'!B27=\"X\", \"Continous\",\"\")","v":""}]
[null,null,null,null,null,null,null,null,null,{"$f":"IF('Proj Info'!B27=\"X\", \"Intermittent\",\"\")","v":""}]
[null,null,null,null,null,null,null,null,null,{"$f":"IF('Proj Info'!B27=\"X\", \"Low\",\"\")","v":""}]
[]
[1.5,5000]
[1,3500]
[0.75,2000]
[0.5,1500]
[0.375,1000]
[4,500]
[8,200]

{"sheet":"MASTER","index":35,"n_rows":6,"n_cols":23,"rows_kept":6,"cut":false,"hidden":true,"merged":[]}
["Project No.: ","Contractor: ","Date of Placement","From","To","Mix","Avg. w/c ","CA","CA T203","IA","IA T203","FA","FA T203","Cement","Type","Fly ash","Type","Slag","Grade","Air","WR","Temp min","Temp max"]
[{"$f":"'Report '!$H$3","v":""},{"$f":"'Report '!$H$5","v":""},{"$f":"'Report '!C4","v":""},{"$f":"'Report '!D4","v":0},{"$f":"'Report '!E4","v":0},{"$f":"'Report '!B13","v":""},{"$f":"'Report '!X13","v":""},{"$f":"'Report '!$S$40","v":""},{"$f":"'Report '!$W$40","v":0},{"$f":"'Report '!$S$41","v":""},{"$f":"'Report '!$W$41","v":0},{"$f":"'Report '!$S$42","v":""},{"$f":"'Report '!$W$42","v":0},{"$f":"'Report '!$U$35","v":""},{"$f":"'Report '!$S$35","v":""},{"$f":"'Report '!$U$36","v":""},{"$f":"'Report '!$S$36","v":""},{"$f":"'Report '!$U$37","v":""},{"$f":"'Report '!$S$37","v":""},{"$f":"'Report '!$S$26","v":""},{"$f":"'Report '!$S$27","v":""},{"$f":"'Report '!$M$5","v":""},{"$f":"'Report '!$M$6","v":""}]
[{"$f":"'Report '!$H$3","v":""},{"$f":"'Report '!$H$5","v":""},{"$f":"'Report '!C5","v":""},{"$f":"'Report '!D5","v":0},{"$f":"'Report '!E5","v":0},{"$f":"'Report '!B14","v":""},{"$f":"'Report '!X14","v":""},{"$f":"'Report '!$S$40","v":""},{"$f":"'Report '!$W$40","v":0},{"$f":"'Report '!$S$41","v":""},{"$f":"'Report '!$W$41","v":0},{"$f":"'Report '!$S$42","v":""},{"$f":"'Report '!$W$42","v":0},{"$f":"'Report '!$U$35","v":""},{"$f":"'Report '!$S$35","v":""},{"$f":"'Report '!$U$36","v":""},{"$f":"'Report '!$S$36","v":""},{"$f":"'Report '!$U$37","v":""},{"$f":"'Report '!$S$37","v":""},{"$f":"'Report '!$S$26","v":""},{"$f":"'Report '!$S$27","v":""},{"$f":"'Report '!$M$5","v":""},{"$f":"'Report '!$M$6","v":""}]
[{"$f":"'Report '!$H$3","v":""},{"$f":"'Report '!$H$5","v":""},{"$f":"'Report '!C6","v":""},{"$f":"'Report '!D6","v":0},{"$f":"'Report '!E6","v":0},{"$f":"'Report '!B15","v":""},{"$f":"'Report '!X15","v":""},{"$f":"'Report '!$S$40","v":""},{"$f":"'Report '!$W$40","v":0},{"$f":"'Report '!$S$41","v":""},{"$f":"'Report '!$W$41","v":0},{"$f":"'Report '!$S$42","v":""},{"$f":"'Report '!$W$42","v":0},{"$f":"'Report '!$U$35","v":""},{"$f":"'Report '!$S$35","v":""},{"$f":"'Report '!$U$36","v":""},{"$f":"'Report '!$S$36","v":""},{"$f":"'Report '!$U$37","v":""},{"$f":"'Report '!$S$37","v":""},{"$f":"'Report '!$S$26","v":""},{"$f":"'Report '!$S$27","v":""},{"$f":"'Report '!$M$5","v":""},{"$f":"'Report '!$M$6","v":""}]
[{"$f":"'Report '!$H$3","v":""},{"$f":"'Report '!$H$5","v":""},{"$f":"'Report '!C7","v":""},{"$f":"'Report '!D7","v":0},{"$f":"'Report '!E7","v":0},{"$f":"'Report '!B16","v":""},{"$f":"'Report '!X16","v":""},{"$f":"'Report '!$S$40","v":""},{"$f":"'Report '!$W$40","v":0},{"$f":"'Report '!$S$41","v":""},{"$f":"'Report '!$W$41","v":0},{"$f":"'Report '!$S$42","v":""},{"$f":"'Report '!$W$42","v":0},{"$f":"'Report '!$U$35","v":""},{"$f":"'Report '!$S$35","v":""},{"$f":"'Report '!$U$36","v":""},{"$f":"'Report '!$S$36","v":""},{"$f":"'Report '!$U$37","v":""},{"$f":"'Report '!$S$37","v":""},{"$f":"'Report '!$S$26","v":""},{"$f":"'Report '!$S$27","v":""},{"$f":"'Report '!$M$5","v":""},{"$f":"'Report '!$M$6","v":""}]
[{"$f":"'Report '!$H$3","v":""},{"$f":"'Report '!$H$5","v":""},{"$f":"'Report '!C8","v":""},{"$f":"'Report '!D8","v":0},{"$f":"'Report '!E8","v":0},{"$f":"'Report '!B17","v":""},{"$f":"'Report '!X17","v":""},{"$f":"'Report '!$S$40","v":""},{"$f":"'Report '!$W$40","v":0},{"$f":"'Report '!$S$41","v":""},{"$f":"'Report '!$W$41","v":0},{"$f":"'Report '!$S$42","v":""},{"$f":"'Report '!$W$42","v":0},{"$f":"'Report '!$U$35","v":""},{"$f":"'Report '!$S$35","v":""},{"$f":"'Report '!$U$36","v":""},{"$f":"'Report '!$S$36","v":""},{"$f":"'Report '!$U$37","v":""},{"$f":"'Report '!$S$37","v":""},{"$f":"'Report '!$S$26","v":""},{"$f":"'Report '!$S$27","v":""},{"$f":"'Report '!$M$5","v":""},{"$f":"'Report '!$M$6","v":""}]